UnstableConsole Output

Skipping 683 KB.. Full Log
.as.weld.ejb.Jsr299BindingsInterceptor.processInvocation(Jsr299BindingsInterceptor.java:93) [wildfly-weld-10.1.0.Final.jar:10.1.0.Final]
	at org.jboss.as.ee.component.interceptors.UserInterceptorFactory$1.processInvocation(UserInterceptorFactory.java:63)
	at org.jboss.invocation.InterceptorContext.proceed(InterceptorContext.java:340) [jboss-invocation-1.5.0.Final.jar:1.5.0.Final]
	at org.jboss.as.ejb3.component.invocationmetrics.ExecutionTimeInterceptor.processInvocation(ExecutionTimeInterceptor.java:43) [wildfly-ejb3-10.1.0.Final.jar:10.1.0.Final]
	at org.jboss.invocation.InterceptorContext.proceed(InterceptorContext.java:340) [jboss-invocation-1.5.0.Final.jar:1.5.0.Final]
	at org.jboss.as.jpa.interceptor.SBInvocationInterceptor.processInvocation(SBInvocationInterceptor.java:47) [wildfly-jpa-10.1.0.Final.jar:10.1.0.Final]
	at org.jboss.invocation.InterceptorContext.proceed(InterceptorContext.java:340) [jboss-invocation-1.5.0.Final.jar:1.5.0.Final]
	at org.jboss.invocation.InterceptorContext$Invocation.proceed(InterceptorContext.java:437) [jboss-invocation-1.5.0.Final.jar:1.5.0.Final]
	at org.jboss.weld.ejb.AbstractEJBRequestScopeActivationInterceptor.aroundInvoke(AbstractEJBRequestScopeActivationInterceptor.java:64) [weld-core-impl-2.3.5.Final.jar:2.3.5.Final]
	at org.jboss.as.weld.ejb.EjbRequestScopeActivationInterceptor.processInvocation(EjbRequestScopeActivationInterceptor.java:83) [wildfly-weld-10.1.0.Final.jar:10.1.0.Final]
	at org.jboss.invocation.InterceptorContext.proceed(InterceptorContext.java:340) [jboss-invocation-1.5.0.Final.jar:1.5.0.Final]
	at org.jboss.as.ee.concurrent.ConcurrentContextInterceptor.processInvocation(ConcurrentContextInterceptor.java:45) [wildfly-ee-10.1.0.Final.jar:10.1.0.Final]
	at org.jboss.invocation.InterceptorContext.proceed(InterceptorContext.java:340) [jboss-invocation-1.5.0.Final.jar:1.5.0.Final]
	at org.jboss.invocation.InitialInterceptor.processInvocation(InitialInterceptor.java:21) [jboss-invocation-1.5.0.Final.jar:1.5.0.Final]
	at org.jboss.invocation.InterceptorContext.proceed(InterceptorContext.java:340) [jboss-invocation-1.5.0.Final.jar:1.5.0.Final]
	at org.jboss.invocation.ChainedInterceptor.processInvocation(ChainedInterceptor.java:61) [jboss-invocation-1.5.0.Final.jar:1.5.0.Final]
	at org.jboss.as.ee.component.interceptors.ComponentDispatcherInterceptor.processInvocation(ComponentDispatcherInterceptor.java:52)
	at org.jboss.invocation.InterceptorContext.proceed(InterceptorContext.java:340) [jboss-invocation-1.5.0.Final.jar:1.5.0.Final]
	at org.jboss.as.ejb3.component.interceptors.NonPooledEJBComponentInstanceAssociatingInterceptor.processInvocation(NonPooledEJBComponentInstanceAssociatingInterceptor.java:59) [wildfly-ejb3-10.1.0.Final.jar:10.1.0.Final]
	at org.jboss.invocation.InterceptorContext.proceed(InterceptorContext.java:340) [jboss-invocation-1.5.0.Final.jar:1.5.0.Final]
	at org.jboss.as.ejb3.tx.CMTTxInterceptor.invokeInCallerTx(CMTTxInterceptor.java:254) [wildfly-ejb3-10.1.0.Final.jar:10.1.0.Final]
	at org.jboss.as.ejb3.tx.CMTTxInterceptor.required(CMTTxInterceptor.java:329) [wildfly-ejb3-10.1.0.Final.jar:10.1.0.Final]
	at org.jboss.as.ejb3.tx.CMTTxInterceptor.processInvocation(CMTTxInterceptor.java:239) [wildfly-ejb3-10.1.0.Final.jar:10.1.0.Final]
	at org.jboss.invocation.InterceptorContext.proceed(InterceptorContext.java:340) [jboss-invocation-1.5.0.Final.jar:1.5.0.Final]
	at org.jboss.as.ejb3.component.interceptors.CurrentInvocationContextInterceptor.processInvocation(CurrentInvocationContextInterceptor.java:41) [wildfly-ejb3-10.1.0.Final.jar:10.1.0.Final]
	at org.jboss.invocation.InterceptorContext.proceed(InterceptorContext.java:340) [jboss-invocation-1.5.0.Final.jar:1.5.0.Final]
	at org.jboss.as.ejb3.component.invocationmetrics.WaitTimeInterceptor.processInvocation(WaitTimeInterceptor.java:47) [wildfly-ejb3-10.1.0.Final.jar:10.1.0.Final]
	at org.jboss.invocation.InterceptorContext.proceed(InterceptorContext.java:340) [jboss-invocation-1.5.0.Final.jar:1.5.0.Final]
	at org.jboss.as.ejb3.security.AuthorizationInterceptor.processInvocation(AuthorizationInterceptor.java:138) [wildfly-ejb3-10.1.0.Final.jar:10.1.0.Final]
	at org.jboss.invocation.InterceptorContext.proceed(InterceptorContext.java:340) [jboss-invocation-1.5.0.Final.jar:1.5.0.Final]
	at org.jboss.as.ejb3.security.SecurityContextInterceptor.processInvocation(SecurityContextInterceptor.java:100) [wildfly-ejb3-10.1.0.Final.jar:10.1.0.Final]
	at org.jboss.invocation.InterceptorContext.proceed(InterceptorContext.java:340) [jboss-invocation-1.5.0.Final.jar:1.5.0.Final]
	at org.jboss.as.ejb3.deployment.processors.StartupAwaitInterceptor.processInvocation(StartupAwaitInterceptor.java:22) [wildfly-ejb3-10.1.0.Final.jar:10.1.0.Final]
	at org.jboss.invocation.InterceptorContext.proceed(InterceptorContext.java:340) [jboss-invocation-1.5.0.Final.jar:1.5.0.Final]
	at org.jboss.as.ejb3.component.interceptors.ShutDownInterceptorFactory$1.processInvocation(ShutDownInterceptorFactory.java:64) [wildfly-ejb3-10.1.0.Final.jar:10.1.0.Final]
	at org.jboss.invocation.InterceptorContext.proceed(InterceptorContext.java:340) [jboss-invocation-1.5.0.Final.jar:1.5.0.Final]
	at org.jboss.as.ejb3.component.interceptors.LoggingInterceptor.processInvocation(LoggingInterceptor.java:67) [wildfly-ejb3-10.1.0.Final.jar:10.1.0.Final]
	at org.jboss.invocation.InterceptorContext.proceed(InterceptorContext.java:340) [jboss-invocation-1.5.0.Final.jar:1.5.0.Final]
	at org.jboss.as.ee.component.NamespaceContextInterceptor.processInvocation(NamespaceContextInterceptor.java:50)
	at org.jboss.invocation.InterceptorContext.proceed(InterceptorContext.java:340) [jboss-invocation-1.5.0.Final.jar:1.5.0.Final]
	at org.jboss.as.ejb3.component.interceptors.AdditionalSetupInterceptor.processInvocation(AdditionalSetupInterceptor.java:54) [wildfly-ejb3-10.1.0.Final.jar:10.1.0.Final]
	at org.jboss.invocation.InterceptorContext.proceed(InterceptorContext.java:340) [jboss-invocation-1.5.0.Final.jar:1.5.0.Final]
	at org.jboss.invocation.ContextClassLoaderInterceptor.processInvocation(ContextClassLoaderInterceptor.java:64) [jboss-invocation-1.5.0.Final.jar:1.5.0.Final]
	at org.jboss.invocation.InterceptorContext.proceed(InterceptorContext.java:340) [jboss-invocation-1.5.0.Final.jar:1.5.0.Final]
	at org.jboss.invocation.InterceptorContext.run(InterceptorContext.java:356) [jboss-invocation-1.5.0.Final.jar:1.5.0.Final]
	at org.wildfly.security.manager.WildFlySecurityManager.doChecked(WildFlySecurityManager.java:636) [wildfly-elytron-1.1.2.Final.jar:1.1.2.Final]
	at org.jboss.invocation.AccessCheckingInterceptor.processInvocation(AccessCheckingInterceptor.java:61) [jboss-invocation-1.5.0.Final.jar:1.5.0.Final]
	at org.jboss.invocation.InterceptorContext.proceed(InterceptorContext.java:340) [jboss-invocation-1.5.0.Final.jar:1.5.0.Final]
	at org.jboss.invocation.InterceptorContext.run(InterceptorContext.java:356) [jboss-invocation-1.5.0.Final.jar:1.5.0.Final]
	at org.jboss.invocation.PrivilegedWithCombinerInterceptor.processInvocation(PrivilegedWithCombinerInterceptor.java:80) [:1.5.0.Final]
	at org.jboss.invocation.InterceptorContext.proceed(InterceptorContext.java:340) [jboss-invocation-1.5.0.Final.jar:1.5.0.Final]
	at org.jboss.invocation.ChainedInterceptor.processInvocation(ChainedInterceptor.java:61) [jboss-invocation-1.5.0.Final.jar:1.5.0.Final]
	at org.jboss.as.ee.component.ViewService$View.invoke(ViewService.java:198)
	at org.jboss.as.ee.component.ViewDescription$1.processInvocation(ViewDescription.java:185)
	at org.jboss.invocation.InterceptorContext.proceed(InterceptorContext.java:340) [jboss-invocation-1.5.0.Final.jar:1.5.0.Final]
	at org.jboss.invocation.ChainedInterceptor.processInvocation(ChainedInterceptor.java:61) [jboss-invocation-1.5.0.Final.jar:1.5.0.Final]
	at org.jboss.as.ee.component.ProxyInvocationHandler.invoke(ProxyInvocationHandler.java:73)
	at es.uvigo.esei.dgss.teama.microstories.service.util.security.RoleCaller$$$view3.call(Unknown Source) [classes:]
	at es.uvigo.esei.microstories.services.StoryServiceIntegrationTest.testCreateStory_Unauthorized_NoUser(StoryServiceIntegrationTest.java:417) [classes:]
	at sun.reflect.NativeMethodAccessorImpl.invoke0(Native Method) [rt.jar:1.8.0_144]
	at sun.reflect.NativeMethodAccessorImpl.invoke(NativeMethodAccessorImpl.java:62) [rt.jar:1.8.0_144]
	at sun.reflect.DelegatingMethodAccessorImpl.invoke(DelegatingMethodAccessorImpl.java:43) [rt.jar:1.8.0_144]
	at java.lang.reflect.Method.invoke(Method.java:498) [rt.jar:1.8.0_144]
	at org.junit.runners.model.FrameworkMethod$1.runReflectiveCall(FrameworkMethod.java:50) [arquillian-junit.jar:]
	at org.junit.internal.runners.model.ReflectiveCallable.run(ReflectiveCallable.java:12) [arquillian-junit.jar:]
	at org.junit.runners.model.FrameworkMethod.invokeExplosively(FrameworkMethod.java:47) [arquillian-junit.jar:]
	at org.jboss.arquillian.junit.Arquillian$8$1.invoke(Arquillian.java:379) [arquillian-junit.jar:]
	at org.jboss.arquillian.container.test.impl.execution.LocalTestExecuter.execute(LocalTestExecuter.java:60) [arquillian-core.jar:]
	at sun.reflect.GeneratedMethodAccessor72.invoke(Unknown Source) [:1.8.0_144]
	at sun.reflect.DelegatingMethodAccessorImpl.invoke(DelegatingMethodAccessorImpl.java:43) [rt.jar:1.8.0_144]
	at java.lang.reflect.Method.invoke(Method.java:498) [rt.jar:1.8.0_144]
	at org.jboss.arquillian.core.impl.ObserverImpl.invoke(ObserverImpl.java:96) [arquillian-core.jar:]
	at org.jboss.arquillian.core.impl.EventContextImpl.invokeObservers(EventContextImpl.java:103) [arquillian-core.jar:]
	at org.jboss.arquillian.core.impl.EventContextImpl.proceed(EventContextImpl.java:85) [arquillian-core.jar:]
	at org.jboss.arquillian.core.impl.ManagerImpl.fire(ManagerImpl.java:143) [arquillian-core.jar:]
	at org.jboss.arquillian.core.impl.ManagerImpl.fire(ManagerImpl.java:114) [arquillian-core.jar:]
	at org.jboss.arquillian.core.impl.EventImpl.fire(EventImpl.java:67) [arquillian-core.jar:]
	at org.jboss.arquillian.container.test.impl.execution.ContainerTestExecuter.execute(ContainerTestExecuter.java:38) [arquillian-core.jar:]
	at sun.reflect.GeneratedMethodAccessor71.invoke(Unknown Source) [:1.8.0_144]
	at sun.reflect.DelegatingMethodAccessorImpl.invoke(DelegatingMethodAccessorImpl.java:43) [rt.jar:1.8.0_144]
	at java.lang.reflect.Method.invoke(Method.java:498) [rt.jar:1.8.0_144]
	at org.jboss.arquillian.core.impl.ObserverImpl.invoke(ObserverImpl.java:96) [arquillian-core.jar:]
	at org.jboss.arquillian.core.impl.EventContextImpl.invokeObservers(EventContextImpl.java:103) [arquillian-core.jar:]
	at org.jboss.arquillian.core.impl.EventContextImpl.proceed(EventContextImpl.java:85) [arquillian-core.jar:]
	at org.jboss.arquillian.test.impl.TestContextHandler.createTestContext(TestContextHandler.java:130) [arquillian-core.jar:]
	at sun.reflect.GeneratedMethodAccessor15.invoke(Unknown Source) [:1.8.0_144]
	at sun.reflect.DelegatingMethodAccessorImpl.invoke(DelegatingMethodAccessorImpl.java:43) [rt.jar:1.8.0_144]
	at java.lang.reflect.Method.invoke(Method.java:498) [rt.jar:1.8.0_144]
	at org.jboss.arquillian.core.impl.ObserverImpl.invoke(ObserverImpl.java:96) [arquillian-core.jar:]
	at org.jboss.arquillian.core.impl.EventContextImpl.proceed(EventContextImpl.java:92) [arquillian-core.jar:]
	at org.jboss.arquillian.test.impl.TestContextHandler.createClassContext(TestContextHandler.java:92) [arquillian-core.jar:]
	at sun.reflect.GeneratedMethodAccessor14.invoke(Unknown Source) [:1.8.0_144]
	at sun.reflect.DelegatingMethodAccessorImpl.invoke(DelegatingMethodAccessorImpl.java:43) [rt.jar:1.8.0_144]
	at java.lang.reflect.Method.invoke(Method.java:498) [rt.jar:1.8.0_144]
	at org.jboss.arquillian.core.impl.ObserverImpl.invoke(ObserverImpl.java:96) [arquillian-core.jar:]
	at org.jboss.arquillian.core.impl.EventContextImpl.proceed(EventContextImpl.java:92) [arquillian-core.jar:]
	at org.jboss.arquillian.test.impl.TestContextHandler.createSuiteContext(TestContextHandler.java:73) [arquillian-core.jar:]
	at sun.reflect.GeneratedMethodAccessor13.invoke(Unknown Source) [:1.8.0_144]
	at sun.reflect.DelegatingMethodAccessorImpl.invoke(DelegatingMethodAccessorImpl.java:43) [rt.jar:1.8.0_144]
	at java.lang.reflect.Method.invoke(Method.java:498) [rt.jar:1.8.0_144]
	at org.jboss.arquillian.core.impl.ObserverImpl.invoke(ObserverImpl.java:96) [arquillian-core.jar:]
	at org.jboss.arquillian.core.impl.EventContextImpl.proceed(EventContextImpl.java:92) [arquillian-core.jar:]
	at org.jboss.arquillian.core.impl.ManagerImpl.fire(ManagerImpl.java:143) [arquillian-core.jar:]
	at org.jboss.arquillian.test.impl.EventTestRunnerAdaptor.test(EventTestRunnerAdaptor.java:136) [arquillian-core.jar:]
	at org.jboss.arquillian.junit.Arquillian$8.evaluate(Arquillian.java:372) [arquillian-junit.jar:]
	at org.junit.internal.runners.statements.ExpectException.evaluate(ExpectException.java:19) [arquillian-junit.jar:]
	at org.jboss.arquillian.junit.Arquillian$4.evaluate(Arquillian.java:246) [arquillian-junit.jar:]
	at org.jboss.arquillian.junit.Arquillian.multiExecute(Arquillian.java:431) [arquillian-junit.jar:]
	at org.jboss.arquillian.junit.Arquillian.access$200(Arquillian.java:55) [arquillian-junit.jar:]
	at org.jboss.arquillian.junit.Arquillian$5.evaluate(Arquillian.java:260) [arquillian-junit.jar:]
	at org.jboss.arquillian.junit.Arquillian$7$1.invoke(Arquillian.java:324) [arquillian-junit.jar:]
	at org.jboss.arquillian.container.test.impl.execution.BeforeLifecycleEventExecuter.on(BeforeLifecycleEventExecuter.java:35) [arquillian-core.jar:]
	at sun.reflect.GeneratedMethodAccessor21.invoke(Unknown Source) [:1.8.0_144]
	at sun.reflect.DelegatingMethodAccessorImpl.invoke(DelegatingMethodAccessorImpl.java:43) [rt.jar:1.8.0_144]
	at java.lang.reflect.Method.invoke(Method.java:498) [rt.jar:1.8.0_144]
	at org.jboss.arquillian.core.impl.ObserverImpl.invoke(ObserverImpl.java:96) [arquillian-core.jar:]
	at org.jboss.arquillian.core.impl.EventContextImpl.invokeObservers(EventContextImpl.java:103) [arquillian-core.jar:]
	at org.jboss.arquillian.core.impl.EventContextImpl.proceed(EventContextImpl.java:85) [arquillian-core.jar:]
	at org.jboss.arquillian.test.impl.TestContextHandler.createTestContext(TestContextHandler.java:130) [arquillian-core.jar:]
	at sun.reflect.GeneratedMethodAccessor15.invoke(Unknown Source) [:1.8.0_144]
	at sun.reflect.DelegatingMethodAccessorImpl.invoke(DelegatingMethodAccessorImpl.java:43) [rt.jar:1.8.0_144]
	at java.lang.reflect.Method.invoke(Method.java:498) [rt.jar:1.8.0_144]
	at org.jboss.arquillian.core.impl.ObserverImpl.invoke(ObserverImpl.java:96) [arquillian-core.jar:]
	at org.jboss.arquillian.core.impl.EventContextImpl.proceed(EventContextImpl.java:92) [arquillian-core.jar:]
	at org.jboss.arquillian.test.impl.TestContextHandler.createClassContext(TestContextHandler.java:92) [arquillian-core.jar:]
	at sun.reflect.GeneratedMethodAccessor14.invoke(Unknown Source) [:1.8.0_144]
	at sun.reflect.DelegatingMethodAccessorImpl.invoke(DelegatingMethodAccessorImpl.java:43) [rt.jar:1.8.0_144]
	at java.lang.reflect.Method.invoke(Method.java:498) [rt.jar:1.8.0_144]
	at org.jboss.arquillian.core.impl.ObserverImpl.invoke(ObserverImpl.java:96) [arquillian-core.jar:]
	at org.jboss.arquillian.core.impl.EventContextImpl.proceed(EventContextImpl.java:92) [arquillian-core.jar:]
	at org.jboss.arquillian.test.impl.TestContextHandler.createSuiteContext(TestContextHandler.java:73) [arquillian-core.jar:]
	at sun.reflect.GeneratedMethodAccessor13.invoke(Unknown Source) [:1.8.0_144]
	at sun.reflect.DelegatingMethodAccessorImpl.invoke(DelegatingMethodAccessorImpl.java:43) [rt.jar:1.8.0_144]
	at java.lang.reflect.Method.invoke(Method.java:498) [rt.jar:1.8.0_144]
	at org.jboss.arquillian.core.impl.ObserverImpl.invoke(ObserverImpl.java:96) [arquillian-core.jar:]
	at org.jboss.arquillian.core.impl.EventContextImpl.proceed(EventContextImpl.java:92) [arquillian-core.jar:]
	at org.jboss.arquillian.core.impl.ManagerImpl.fire(ManagerImpl.java:143) [arquillian-core.jar:]
	at org.jboss.arquillian.core.impl.ManagerImpl.fire(ManagerImpl.java:114) [arquillian-core.jar:]
	at org.jboss.arquillian.test.impl.EventTestRunnerAdaptor.fireCustomLifecycle(EventTestRunnerAdaptor.java:159) [arquillian-core.jar:]
	at org.jboss.arquillian.junit.Arquillian$7.evaluate(Arquillian.java:317) [arquillian-junit.jar:]
	at org.junit.runners.ParentRunner.runLeaf(ParentRunner.java:325) [arquillian-junit.jar:]
	at org.junit.runners.BlockJUnit4ClassRunner.runChild(BlockJUnit4ClassRunner.java:78) [arquillian-junit.jar:]
	at org.junit.runners.BlockJUnit4ClassRunner.runChild(BlockJUnit4ClassRunner.java:57) [arquillian-junit.jar:]
	at org.junit.runners.ParentRunner$3.run(ParentRunner.java:290) [arquillian-junit.jar:]
	at org.junit.runners.ParentRunner$1.schedule(ParentRunner.java:71) [arquillian-junit.jar:]
	at org.junit.runners.ParentRunner.runChildren(ParentRunner.java:288) [arquillian-junit.jar:]
	at org.junit.runners.ParentRunner.access$000(ParentRunner.java:58) [arquillian-junit.jar:]
	at org.junit.runners.ParentRunner$2.evaluate(ParentRunner.java:268) [arquillian-junit.jar:]
	at org.jboss.arquillian.junit.Arquillian$2.evaluate(Arquillian.java:205) [arquillian-junit.jar:]
	at org.jboss.arquillian.junit.Arquillian.multiExecute(Arquillian.java:431) [arquillian-junit.jar:]
	at org.jboss.arquillian.junit.Arquillian.access$200(Arquillian.java:55) [arquillian-junit.jar:]
	at org.jboss.arquillian.junit.Arquillian$3.evaluate(Arquillian.java:219) [arquillian-junit.jar:]
	at org.junit.runners.ParentRunner.run(ParentRunner.java:363) [arquillian-junit.jar:]
	at org.jboss.arquillian.junit.Arquillian.run(Arquillian.java:167) [arquillian-junit.jar:]
	at org.junit.runner.JUnitCore.run(JUnitCore.java:137) [arquillian-junit.jar:]
	at org.junit.runner.JUnitCore.run(JUnitCore.java:115) [arquillian-junit.jar:]
	at org.jboss.arquillian.junit.container.JUnitTestRunner.execute(JUnitTestRunner.java:66) [arquillian-junit.jar:]
	at org.jboss.arquillian.protocol.servlet.runner.ServletTestRunner.executeTest(ServletTestRunner.java:170) [arquillian-protocol.jar:]
	at org.jboss.arquillian.protocol.servlet.runner.ServletTestRunner.execute(ServletTestRunner.java:135) [arquillian-protocol.jar:]
	at org.jboss.arquillian.protocol.servlet.runner.ServletTestRunner.doGet(ServletTestRunner.java:98) [arquillian-protocol.jar:]
	at javax.servlet.http.HttpServlet.service(HttpServlet.java:687) [jboss-servlet-api_3.1_spec-1.0.0.Final.jar:1.0.0.Final]
	at javax.servlet.http.HttpServlet.service(HttpServlet.java:790) [jboss-servlet-api_3.1_spec-1.0.0.Final.jar:1.0.0.Final]
	at io.undertow.servlet.handlers.ServletHandler.handleRequest(ServletHandler.java:85) [undertow-servlet-1.4.0.Final.jar:1.4.0.Final]
	at io.undertow.servlet.handlers.security.ServletSecurityRoleHandler.handleRequest(ServletSecurityRoleHandler.java:62) [undertow-servlet-1.4.0.Final.jar:1.4.0.Final]
	at io.undertow.servlet.handlers.ServletDispatchingHandler.handleRequest(ServletDispatchingHandler.java:36) [undertow-servlet-1.4.0.Final.jar:1.4.0.Final]
	at org.wildfly.extension.undertow.security.SecurityContextAssociationHandler.handleRequest(SecurityContextAssociationHandler.java:78)
	at io.undertow.server.handlers.PredicateHandler.handleRequest(PredicateHandler.java:43) [undertow-core-1.4.0.Final.jar:1.4.0.Final]
	at io.undertow.servlet.handlers.security.SSLInformationAssociationHandler.handleRequest(SSLInformationAssociationHandler.java:131) [undertow-servlet-1.4.0.Final.jar:1.4.0.Final]
	at io.undertow.servlet.handlers.security.ServletAuthenticationCallHandler.handleRequest(ServletAuthenticationCallHandler.java:57) [undertow-servlet-1.4.0.Final.jar:1.4.0.Final]
	at io.undertow.server.handlers.PredicateHandler.handleRequest(PredicateHandler.java:43) [undertow-core-1.4.0.Final.jar:1.4.0.Final]
	at io.undertow.security.handlers.AbstractConfidentialityHandler.handleRequest(AbstractConfidentialityHandler.java:46) [undertow-core-1.4.0.Final.jar:1.4.0.Final]
	at io.undertow.servlet.handlers.security.ServletConfidentialityConstraintHandler.handleRequest(ServletConfidentialityConstraintHandler.java:64) [undertow-servlet-1.4.0.Final.jar:1.4.0.Final]
	at io.undertow.security.handlers.AuthenticationMechanismsHandler.handleRequest(AuthenticationMechanismsHandler.java:60) [undertow-core-1.4.0.Final.jar:1.4.0.Final]
	at io.undertow.servlet.handlers.security.CachedAuthenticatedSessionHandler.handleRequest(CachedAuthenticatedSessionHandler.java:77) [undertow-servlet-1.4.0.Final.jar:1.4.0.Final]
	at io.undertow.security.handlers.NotificationReceiverHandler.handleRequest(NotificationReceiverHandler.java:50) [undertow-core-1.4.0.Final.jar:1.4.0.Final]
	at io.undertow.security.handlers.AbstractSecurityContextAssociationHandler.handleRequest(AbstractSecurityContextAssociationHandler.java:43) [undertow-core-1.4.0.Final.jar:1.4.0.Final]
	at io.undertow.server.handlers.PredicateHandler.handleRequest(PredicateHandler.java:43) [undertow-core-1.4.0.Final.jar:1.4.0.Final]
	at org.wildfly.extension.undertow.security.jacc.JACCContextIdHandler.handleRequest(JACCContextIdHandler.java:61)
	at io.undertow.server.handlers.PredicateHandler.handleRequest(PredicateHandler.java:43) [undertow-core-1.4.0.Final.jar:1.4.0.Final]
	at io.undertow.server.handlers.PredicateHandler.handleRequest(PredicateHandler.java:43) [undertow-core-1.4.0.Final.jar:1.4.0.Final]
	at io.undertow.servlet.handlers.ServletInitialHandler.handleFirstRequest(ServletInitialHandler.java:292) [undertow-servlet-1.4.0.Final.jar:1.4.0.Final]
	at io.undertow.servlet.handlers.ServletInitialHandler.access$100(ServletInitialHandler.java:81) [undertow-servlet-1.4.0.Final.jar:1.4.0.Final]
	at io.undertow.servlet.handlers.ServletInitialHandler$2.call(ServletInitialHandler.java:138) [undertow-servlet-1.4.0.Final.jar:1.4.0.Final]
	at io.undertow.servlet.handlers.ServletInitialHandler$2.call(ServletInitialHandler.java:135) [undertow-servlet-1.4.0.Final.jar:1.4.0.Final]
	at io.undertow.servlet.core.ServletRequestContextThreadSetupAction$1.call(ServletRequestContextThreadSetupAction.java:48) [undertow-servlet-1.4.0.Final.jar:1.4.0.Final]
	at io.undertow.servlet.core.ContextClassLoaderSetupAction$1.call(ContextClassLoaderSetupAction.java:43) [undertow-servlet-1.4.0.Final.jar:1.4.0.Final]
	at io.undertow.servlet.api.LegacyThreadSetupActionWrapper$1.call(LegacyThreadSetupActionWrapper.java:44) [undertow-servlet-1.4.0.Final.jar:1.4.0.Final]
	at io.undertow.servlet.api.LegacyThreadSetupActionWrapper$1.call(LegacyThreadSetupActionWrapper.java:44) [undertow-servlet-1.4.0.Final.jar:1.4.0.Final]
	at io.undertow.servlet.api.LegacyThreadSetupActionWrapper$1.call(LegacyThreadSetupActionWrapper.java:44) [undertow-servlet-1.4.0.Final.jar:1.4.0.Final]
	at io.undertow.servlet.api.LegacyThreadSetupActionWrapper$1.call(LegacyThreadSetupActionWrapper.java:44) [undertow-servlet-1.4.0.Final.jar:1.4.0.Final]
	at io.undertow.servlet.api.LegacyThreadSetupActionWrapper$1.call(LegacyThreadSetupActionWrapper.java:44) [undertow-servlet-1.4.0.Final.jar:1.4.0.Final]
	at io.undertow.servlet.api.LegacyThreadSetupActionWrapper$1.call(LegacyThreadSetupActionWrapper.java:44) [undertow-servlet-1.4.0.Final.jar:1.4.0.Final]
	at io.undertow.servlet.handlers.ServletInitialHandler.dispatchRequest(ServletInitialHandler.java:272) [undertow-servlet-1.4.0.Final.jar:1.4.0.Final]
	at io.undertow.servlet.handlers.ServletInitialHandler.access$000(ServletInitialHandler.java:81) [undertow-servlet-1.4.0.Final.jar:1.4.0.Final]
	at io.undertow.servlet.handlers.ServletInitialHandler$1.handleRequest(ServletInitialHandler.java:104) [undertow-servlet-1.4.0.Final.jar:1.4.0.Final]
	at io.undertow.server.Connectors.executeRootHandler(Connectors.java:202) [undertow-core-1.4.0.Final.jar:1.4.0.Final]
	at io.undertow.server.HttpServerExchange$1.run(HttpServerExchange.java:805) [undertow-core-1.4.0.Final.jar:1.4.0.Final]
	at java.util.concurrent.ThreadPoolExecutor.runWorker(ThreadPoolExecutor.java:1149) [rt.jar:1.8.0_144]
	at java.util.concurrent.ThreadPoolExecutor$Worker.run(ThreadPoolExecutor.java:624) [rt.jar:1.8.0_144]
	at java.lang.Thread.run(Thread.java:748) [rt.jar:1.8.0_144]
Caused by: javax.persistence.NoResultException: No entity found for query
	at org.hibernate.jpa.internal.QueryImpl.getSingleResult(QueryImpl.java:532) [hibernate-entitymanager-5.0.10.Final.jar:5.0.10.Final]
	at es.uvigo.esei.microstories.services.UserService.getCurrentUser(UserService.java:32) [classes:]
	at sun.reflect.GeneratedMethodAccessor92.invoke(Unknown Source) [:1.8.0_144]
	at sun.reflect.DelegatingMethodAccessorImpl.invoke(DelegatingMethodAccessorImpl.java:43) [rt.jar:1.8.0_144]
	at java.lang.reflect.Method.invoke(Method.java:498) [rt.jar:1.8.0_144]
	at org.jboss.as.ee.component.ManagedReferenceMethodInterceptor.processInvocation(ManagedReferenceMethodInterceptor.java:52)
	at org.jboss.invocation.InterceptorContext.proceed(InterceptorContext.java:340) [jboss-invocation-1.5.0.Final.jar:1.5.0.Final]
	at org.jboss.invocation.InterceptorContext$Invocation.proceed(InterceptorContext.java:437) [jboss-invocation-1.5.0.Final.jar:1.5.0.Final]
	at org.jboss.as.weld.ejb.Jsr299BindingsInterceptor.doMethodInterception(Jsr299BindingsInterceptor.java:82) [wildfly-weld-10.1.0.Final.jar:10.1.0.Final]
	at org.jboss.as.weld.ejb.Jsr299BindingsInterceptor.processInvocation(Jsr299BindingsInterceptor.java:93) [wildfly-weld-10.1.0.Final.jar:10.1.0.Final]
	at org.jboss.as.ee.component.interceptors.UserInterceptorFactory$1.processInvocation(UserInterceptorFactory.java:63)
	at org.jboss.invocation.InterceptorContext.proceed(InterceptorContext.java:340) [jboss-invocation-1.5.0.Final.jar:1.5.0.Final]
	at org.jboss.as.ejb3.component.invocationmetrics.ExecutionTimeInterceptor.processInvocation(ExecutionTimeInterceptor.java:43) [wildfly-ejb3-10.1.0.Final.jar:10.1.0.Final]
	at org.jboss.invocation.InterceptorContext.proceed(InterceptorContext.java:340) [jboss-invocation-1.5.0.Final.jar:1.5.0.Final]
	at org.jboss.as.jpa.interceptor.SBInvocationInterceptor.processInvocation(SBInvocationInterceptor.java:47) [wildfly-jpa-10.1.0.Final.jar:10.1.0.Final]
	at org.jboss.invocation.InterceptorContext.proceed(InterceptorContext.java:340) [jboss-invocation-1.5.0.Final.jar:1.5.0.Final]
	at org.jboss.invocation.InterceptorContext$Invocation.proceed(InterceptorContext.java:437) [jboss-invocation-1.5.0.Final.jar:1.5.0.Final]
	at org.jboss.weld.ejb.AbstractEJBRequestScopeActivationInterceptor.aroundInvoke(AbstractEJBRequestScopeActivationInterceptor.java:64) [weld-core-impl-2.3.5.Final.jar:2.3.5.Final]
	at org.jboss.as.weld.ejb.EjbRequestScopeActivationInterceptor.processInvocation(EjbRequestScopeActivationInterceptor.java:83) [wildfly-weld-10.1.0.Final.jar:10.1.0.Final]
	at org.jboss.invocation.InterceptorContext.proceed(InterceptorContext.java:340) [jboss-invocation-1.5.0.Final.jar:1.5.0.Final]
	at org.jboss.as.ee.concurrent.ConcurrentContextInterceptor.processInvocation(ConcurrentContextInterceptor.java:45) [wildfly-ee-10.1.0.Final.jar:10.1.0.Final]
	at org.jboss.invocation.InterceptorContext.proceed(InterceptorContext.java:340) [jboss-invocation-1.5.0.Final.jar:1.5.0.Final]
	at org.jboss.invocation.InitialInterceptor.processInvocation(InitialInterceptor.java:21) [jboss-invocation-1.5.0.Final.jar:1.5.0.Final]
	at org.jboss.invocation.InterceptorContext.proceed(InterceptorContext.java:340) [jboss-invocation-1.5.0.Final.jar:1.5.0.Final]
	at org.jboss.invocation.ChainedInterceptor.processInvocation(ChainedInterceptor.java:61) [jboss-invocation-1.5.0.Final.jar:1.5.0.Final]
	at org.jboss.as.ee.component.interceptors.ComponentDispatcherInterceptor.processInvocation(ComponentDispatcherInterceptor.java:52)
	at org.jboss.invocation.InterceptorContext.proceed(InterceptorContext.java:340) [jboss-invocation-1.5.0.Final.jar:1.5.0.Final]
	at org.jboss.as.ejb3.component.interceptors.NonPooledEJBComponentInstanceAssociatingInterceptor.processInvocation(NonPooledEJBComponentInstanceAssociatingInterceptor.java:59) [wildfly-ejb3-10.1.0.Final.jar:10.1.0.Final]
	at org.jboss.invocation.InterceptorContext.proceed(InterceptorContext.java:340) [jboss-invocation-1.5.0.Final.jar:1.5.0.Final]
	at org.jboss.as.ejb3.tx.CMTTxInterceptor.invokeInCallerTx(CMTTxInterceptor.java:254) [wildfly-ejb3-10.1.0.Final.jar:10.1.0.Final]
	... 333 more

12:00:21,262 ERROR [org.jboss.as.ejb3.invocation] (default task-27) WFLYEJB0034: EJB Invocation failed on component creator-caller for method public abstract java.lang.Object es.uvigo.esei.dgss.teama.microstories.service.util.security.RoleCaller.call(java.util.function.Supplier): javax.ejb.EJBTransactionRolledbackException: No entity found for query
	at org.jboss.as.ejb3.tx.CMTTxInterceptor.handleInCallerTx(CMTTxInterceptor.java:159) [wildfly-ejb3-10.1.0.Final.jar:10.1.0.Final]
	at org.jboss.as.ejb3.tx.CMTTxInterceptor.invokeInCallerTx(CMTTxInterceptor.java:256) [wildfly-ejb3-10.1.0.Final.jar:10.1.0.Final]
	at org.jboss.as.ejb3.tx.CMTTxInterceptor.required(CMTTxInterceptor.java:329) [wildfly-ejb3-10.1.0.Final.jar:10.1.0.Final]
	at org.jboss.as.ejb3.tx.CMTTxInterceptor.processInvocation(CMTTxInterceptor.java:239) [wildfly-ejb3-10.1.0.Final.jar:10.1.0.Final]
	at org.jboss.invocation.InterceptorContext.proceed(InterceptorContext.java:340) [jboss-invocation-1.5.0.Final.jar:1.5.0.Final]
	at org.jboss.as.ejb3.component.interceptors.CurrentInvocationContextInterceptor.processInvocation(CurrentInvocationContextInterceptor.java:41) [wildfly-ejb3-10.1.0.Final.jar:10.1.0.Final]
	at org.jboss.invocation.InterceptorContext.proceed(InterceptorContext.java:340) [jboss-invocation-1.5.0.Final.jar:1.5.0.Final]
	at org.jboss.as.ejb3.component.invocationmetrics.WaitTimeInterceptor.processInvocation(WaitTimeInterceptor.java:47) [wildfly-ejb3-10.1.0.Final.jar:10.1.0.Final]
	at org.jboss.invocation.InterceptorContext.proceed(InterceptorContext.java:340) [jboss-invocation-1.5.0.Final.jar:1.5.0.Final]
	at org.jboss.as.ejb3.security.AuthorizationInterceptor.processInvocation(AuthorizationInterceptor.java:138) [wildfly-ejb3-10.1.0.Final.jar:10.1.0.Final]
	at org.jboss.invocation.InterceptorContext.proceed(InterceptorContext.java:340) [jboss-invocation-1.5.0.Final.jar:1.5.0.Final]
	at org.jboss.as.ejb3.security.SecurityContextInterceptor.processInvocation(SecurityContextInterceptor.java:100) [wildfly-ejb3-10.1.0.Final.jar:10.1.0.Final]
	at org.jboss.invocation.InterceptorContext.proceed(InterceptorContext.java:340) [jboss-invocation-1.5.0.Final.jar:1.5.0.Final]
	at org.jboss.as.ejb3.deployment.processors.StartupAwaitInterceptor.processInvocation(StartupAwaitInterceptor.java:22) [wildfly-ejb3-10.1.0.Final.jar:10.1.0.Final]
	at org.jboss.invocation.InterceptorContext.proceed(InterceptorContext.java:340) [jboss-invocation-1.5.0.Final.jar:1.5.0.Final]
	at org.jboss.as.ejb3.component.interceptors.ShutDownInterceptorFactory$1.processInvocation(ShutDownInterceptorFactory.java:64) [wildfly-ejb3-10.1.0.Final.jar:10.1.0.Final]
	at org.jboss.invocation.InterceptorContext.proceed(InterceptorContext.java:340) [jboss-invocation-1.5.0.Final.jar:1.5.0.Final]
	at org.jboss.as.ejb3.component.interceptors.LoggingInterceptor.processInvocation(LoggingInterceptor.java:67) [wildfly-ejb3-10.1.0.Final.jar:10.1.0.Final]
	at org.jboss.invocation.InterceptorContext.proceed(InterceptorContext.java:340) [jboss-invocation-1.5.0.Final.jar:1.5.0.Final]
	at org.jboss.as.ee.component.NamespaceContextInterceptor.processInvocation(NamespaceContextInterceptor.java:50)
	at org.jboss.invocation.InterceptorContext.proceed(InterceptorContext.java:340) [jboss-invocation-1.5.0.Final.jar:1.5.0.Final]
	at org.jboss.as.ejb3.component.interceptors.AdditionalSetupInterceptor.processInvocation(AdditionalSetupInterceptor.java:54) [wildfly-ejb3-10.1.0.Final.jar:10.1.0.Final]
	at org.jboss.invocation.InterceptorContext.proceed(InterceptorContext.java:340) [jboss-invocation-1.5.0.Final.jar:1.5.0.Final]
	at org.jboss.invocation.ContextClassLoaderInterceptor.processInvocation(ContextClassLoaderInterceptor.java:64) [jboss-invocation-1.5.0.Final.jar:1.5.0.Final]
	at org.jboss.invocation.InterceptorContext.proceed(InterceptorContext.java:340) [jboss-invocation-1.5.0.Final.jar:1.5.0.Final]
	at org.jboss.invocation.InterceptorContext.run(InterceptorContext.java:356) [jboss-invocation-1.5.0.Final.jar:1.5.0.Final]
	at org.wildfly.security.manager.WildFlySecurityManager.doChecked(WildFlySecurityManager.java:636) [wildfly-elytron-1.1.2.Final.jar:1.1.2.Final]
	at org.jboss.invocation.AccessCheckingInterceptor.processInvocation(AccessCheckingInterceptor.java:61) [jboss-invocation-1.5.0.Final.jar:1.5.0.Final]
	at org.jboss.invocation.InterceptorContext.proceed(InterceptorContext.java:340) [jboss-invocation-1.5.0.Final.jar:1.5.0.Final]
	at org.jboss.invocation.InterceptorContext.run(InterceptorContext.java:356) [jboss-invocation-1.5.0.Final.jar:1.5.0.Final]
	at org.jboss.invocation.PrivilegedWithCombinerInterceptor.processInvocation(PrivilegedWithCombinerInterceptor.java:80) [:1.5.0.Final]
	at org.jboss.invocation.InterceptorContext.proceed(InterceptorContext.java:340) [jboss-invocation-1.5.0.Final.jar:1.5.0.Final]
	at org.jboss.invocation.ChainedInterceptor.processInvocation(ChainedInterceptor.java:61) [jboss-invocation-1.5.0.Final.jar:1.5.0.Final]
	at org.jboss.as.ee.component.ViewService$View.invoke(ViewService.java:198)
	at org.jboss.as.ee.component.ViewDescription$1.processInvocation(ViewDescription.java:185)
	at org.jboss.invocation.InterceptorContext.proceed(InterceptorContext.java:340) [jboss-invocation-1.5.0.Final.jar:1.5.0.Final]
	at org.jboss.invocation.ChainedInterceptor.processInvocation(ChainedInterceptor.java:61) [jboss-invocation-1.5.0.Final.jar:1.5.0.Final]
	at org.jboss.as.ee.component.ProxyInvocationHandler.invoke(ProxyInvocationHandler.java:73)
	at es.uvigo.esei.microstories.services.UserService$$$view2.getCurrentUser(Unknown Source) [classes:]
	at sun.reflect.GeneratedMethodAccessor92.invoke(Unknown Source) [:1.8.0_144]
	at sun.reflect.DelegatingMethodAccessorImpl.invoke(DelegatingMethodAccessorImpl.java:43) [rt.jar:1.8.0_144]
	at java.lang.reflect.Method.invoke(Method.java:498) [rt.jar:1.8.0_144]
	at org.jboss.weld.util.reflection.Reflections.invokeAndUnwrap(Reflections.java:433) [weld-core-impl-2.3.5.Final.jar:2.3.5.Final]
	at org.jboss.weld.bean.proxy.EnterpriseBeanProxyMethodHandler.invoke(EnterpriseBeanProxyMethodHandler.java:128) [weld-core-impl-2.3.5.Final.jar:2.3.5.Final]
	at org.jboss.weld.bean.proxy.EnterpriseTargetBeanInstance.invoke(EnterpriseTargetBeanInstance.java:56) [weld-core-impl-2.3.5.Final.jar:2.3.5.Final]
	at org.jboss.weld.bean.proxy.InjectionPointPropagatingEnterpriseTargetBeanInstance.invoke(InjectionPointPropagatingEnterpriseTargetBeanInstance.java:67) [weld-core-impl-2.3.5.Final.jar:2.3.5.Final]
	at org.jboss.weld.bean.proxy.ProxyMethodHandler.invoke(ProxyMethodHandler.java:100) [weld-core-impl-2.3.5.Final.jar:2.3.5.Final]
	at es.uvigo.esei.microstories.services.UserService$Proxy$_$$_Weld$EnterpriseProxy$.getCurrentUser(Unknown Source) [classes:]
	at es.uvigo.esei.microstories.services.StoryService.createStory(StoryService.java:428) [classes:]
	at sun.reflect.NativeMethodAccessorImpl.invoke0(Native Method) [rt.jar:1.8.0_144]
	at sun.reflect.NativeMethodAccessorImpl.invoke(NativeMethodAccessorImpl.java:62) [rt.jar:1.8.0_144]
	at sun.reflect.DelegatingMethodAccessorImpl.invoke(DelegatingMethodAccessorImpl.java:43) [rt.jar:1.8.0_144]
	at java.lang.reflect.Method.invoke(Method.java:498) [rt.jar:1.8.0_144]
	at org.jboss.as.ee.component.ManagedReferenceMethodInterceptor.processInvocation(ManagedReferenceMethodInterceptor.java:52)
	at org.jboss.invocation.InterceptorContext.proceed(InterceptorContext.java:340) [jboss-invocation-1.5.0.Final.jar:1.5.0.Final]
	at org.jboss.invocation.InterceptorContext$Invocation.proceed(InterceptorContext.java:437) [jboss-invocation-1.5.0.Final.jar:1.5.0.Final]
	at org.jboss.as.weld.ejb.Jsr299BindingsInterceptor.doMethodInterception(Jsr299BindingsInterceptor.java:82) [wildfly-weld-10.1.0.Final.jar:10.1.0.Final]
	at org.jboss.as.weld.ejb.Jsr299BindingsInterceptor.processInvocation(Jsr299BindingsInterceptor.java:93) [wildfly-weld-10.1.0.Final.jar:10.1.0.Final]
	at org.jboss.as.ee.component.interceptors.UserInterceptorFactory$1.processInvocation(UserInterceptorFactory.java:63)
	at org.jboss.invocation.InterceptorContext.proceed(InterceptorContext.java:340) [jboss-invocation-1.5.0.Final.jar:1.5.0.Final]
	at org.jboss.as.ejb3.component.invocationmetrics.ExecutionTimeInterceptor.processInvocation(ExecutionTimeInterceptor.java:43) [wildfly-ejb3-10.1.0.Final.jar:10.1.0.Final]
	at org.jboss.invocation.InterceptorContext.proceed(InterceptorContext.java:340) [jboss-invocation-1.5.0.Final.jar:1.5.0.Final]
	at org.jboss.as.jpa.interceptor.SBInvocationInterceptor.processInvocation(SBInvocationInterceptor.java:47) [wildfly-jpa-10.1.0.Final.jar:10.1.0.Final]
	at org.jboss.invocation.InterceptorContext.proceed(InterceptorContext.java:340) [jboss-invocation-1.5.0.Final.jar:1.5.0.Final]
	at org.jboss.invocation.InterceptorContext$Invocation.proceed(InterceptorContext.java:437) [jboss-invocation-1.5.0.Final.jar:1.5.0.Final]
	at org.jboss.weld.ejb.AbstractEJBRequestScopeActivationInterceptor.aroundInvoke(AbstractEJBRequestScopeActivationInterceptor.java:64) [weld-core-impl-2.3.5.Final.jar:2.3.5.Final]
	at org.jboss.as.weld.ejb.EjbRequestScopeActivationInterceptor.processInvocation(EjbRequestScopeActivationInterceptor.java:83) [wildfly-weld-10.1.0.Final.jar:10.1.0.Final]
	at org.jboss.invocation.InterceptorContext.proceed(InterceptorContext.java:340) [jboss-invocation-1.5.0.Final.jar:1.5.0.Final]
	at org.jboss.as.ee.concurrent.ConcurrentContextInterceptor.processInvocation(ConcurrentContextInterceptor.java:45) [wildfly-ee-10.1.0.Final.jar:10.1.0.Final]
	at org.jboss.invocation.InterceptorContext.proceed(InterceptorContext.java:340) [jboss-invocation-1.5.0.Final.jar:1.5.0.Final]
	at org.jboss.invocation.InitialInterceptor.processInvocation(InitialInterceptor.java:21) [jboss-invocation-1.5.0.Final.jar:1.5.0.Final]
	at org.jboss.invocation.InterceptorContext.proceed(InterceptorContext.java:340) [jboss-invocation-1.5.0.Final.jar:1.5.0.Final]
	at org.jboss.invocation.ChainedInterceptor.processInvocation(ChainedInterceptor.java:61) [jboss-invocation-1.5.0.Final.jar:1.5.0.Final]
	at org.jboss.as.ee.component.interceptors.ComponentDispatcherInterceptor.processInvocation(ComponentDispatcherInterceptor.java:52)
	at org.jboss.invocation.InterceptorContext.proceed(InterceptorContext.java:340) [jboss-invocation-1.5.0.Final.jar:1.5.0.Final]
	at org.jboss.as.ejb3.component.interceptors.NonPooledEJBComponentInstanceAssociatingInterceptor.processInvocation(NonPooledEJBComponentInstanceAssociatingInterceptor.java:59) [wildfly-ejb3-10.1.0.Final.jar:10.1.0.Final]
	at org.jboss.invocation.InterceptorContext.proceed(InterceptorContext.java:340) [jboss-invocation-1.5.0.Final.jar:1.5.0.Final]
	at org.jboss.as.ejb3.tx.CMTTxInterceptor.invokeInCallerTx(CMTTxInterceptor.java:254) [wildfly-ejb3-10.1.0.Final.jar:10.1.0.Final]
	at org.jboss.as.ejb3.tx.CMTTxInterceptor.required(CMTTxInterceptor.java:329) [wildfly-ejb3-10.1.0.Final.jar:10.1.0.Final]
	at org.jboss.as.ejb3.tx.CMTTxInterceptor.processInvocation(CMTTxInterceptor.java:239) [wildfly-ejb3-10.1.0.Final.jar:10.1.0.Final]
	at org.jboss.invocation.InterceptorContext.proceed(InterceptorContext.java:340) [jboss-invocation-1.5.0.Final.jar:1.5.0.Final]
	at org.jboss.as.ejb3.component.interceptors.CurrentInvocationContextInterceptor.processInvocation(CurrentInvocationContextInterceptor.java:41) [wildfly-ejb3-10.1.0.Final.jar:10.1.0.Final]
	at org.jboss.invocation.InterceptorContext.proceed(InterceptorContext.java:340) [jboss-invocation-1.5.0.Final.jar:1.5.0.Final]
	at org.jboss.as.ejb3.component.invocationmetrics.WaitTimeInterceptor.processInvocation(WaitTimeInterceptor.java:47) [wildfly-ejb3-10.1.0.Final.jar:10.1.0.Final]
	at org.jboss.invocation.InterceptorContext.proceed(InterceptorContext.java:340) [jboss-invocation-1.5.0.Final.jar:1.5.0.Final]
	at org.jboss.as.ejb3.security.AuthorizationInterceptor.processInvocation(AuthorizationInterceptor.java:138) [wildfly-ejb3-10.1.0.Final.jar:10.1.0.Final]
	at org.jboss.invocation.InterceptorContext.proceed(InterceptorContext.java:340) [jboss-invocation-1.5.0.Final.jar:1.5.0.Final]
	at org.jboss.as.ejb3.security.SecurityContextInterceptor.processInvocation(SecurityContextInterceptor.java:100) [wildfly-ejb3-10.1.0.Final.jar:10.1.0.Final]
	at org.jboss.invocation.InterceptorContext.proceed(InterceptorContext.java:340) [jboss-invocation-1.5.0.Final.jar:1.5.0.Final]
	at org.jboss.as.ejb3.deployment.processors.StartupAwaitInterceptor.processInvocation(StartupAwaitInterceptor.java:22) [wildfly-ejb3-10.1.0.Final.jar:10.1.0.Final]
	at org.jboss.invocation.InterceptorContext.proceed(InterceptorContext.java:340) [jboss-invocation-1.5.0.Final.jar:1.5.0.Final]
	at org.jboss.as.ejb3.component.interceptors.ShutDownInterceptorFactory$1.processInvocation(ShutDownInterceptorFactory.java:64) [wildfly-ejb3-10.1.0.Final.jar:10.1.0.Final]
	at org.jboss.invocation.InterceptorContext.proceed(InterceptorContext.java:340) [jboss-invocation-1.5.0.Final.jar:1.5.0.Final]
	at org.jboss.as.ejb3.component.interceptors.LoggingInterceptor.processInvocation(LoggingInterceptor.java:67) [wildfly-ejb3-10.1.0.Final.jar:10.1.0.Final]
	at org.jboss.invocation.InterceptorContext.proceed(InterceptorContext.java:340) [jboss-invocation-1.5.0.Final.jar:1.5.0.Final]
	at org.jboss.as.ee.component.NamespaceContextInterceptor.processInvocation(NamespaceContextInterceptor.java:50)
	at org.jboss.invocation.InterceptorContext.proceed(InterceptorContext.java:340) [jboss-invocation-1.5.0.Final.jar:1.5.0.Final]
	at org.jboss.as.ejb3.component.interceptors.AdditionalSetupInterceptor.processInvocation(AdditionalSetupInterceptor.java:54) [wildfly-ejb3-10.1.0.Final.jar:10.1.0.Final]
	at org.jboss.invocation.InterceptorContext.proceed(InterceptorContext.java:340) [jboss-invocation-1.5.0.Final.jar:1.5.0.Final]
	at org.jboss.invocation.ContextClassLoaderInterceptor.processInvocation(ContextClassLoaderInterceptor.java:64) [jboss-invocation-1.5.0.Final.jar:1.5.0.Final]
	at org.jboss.invocation.InterceptorContext.proceed(InterceptorContext.java:340) [jboss-invocation-1.5.0.Final.jar:1.5.0.Final]
	at org.jboss.invocation.InterceptorContext.run(InterceptorContext.java:356) [jboss-invocation-1.5.0.Final.jar:1.5.0.Final]
	at org.wildfly.security.manager.WildFlySecurityManager.doChecked(WildFlySecurityManager.java:636) [wildfly-elytron-1.1.2.Final.jar:1.1.2.Final]
	at org.jboss.invocation.AccessCheckingInterceptor.processInvocation(AccessCheckingInterceptor.java:61) [jboss-invocation-1.5.0.Final.jar:1.5.0.Final]
	at org.jboss.invocation.InterceptorContext.proceed(InterceptorContext.java:340) [jboss-invocation-1.5.0.Final.jar:1.5.0.Final]
	at org.jboss.invocation.InterceptorContext.run(InterceptorContext.java:356) [jboss-invocation-1.5.0.Final.jar:1.5.0.Final]
	at org.jboss.invocation.PrivilegedWithCombinerInterceptor.processInvocation(PrivilegedWithCombinerInterceptor.java:80) [:1.5.0.Final]
	at org.jboss.invocation.InterceptorContext.proceed(InterceptorContext.java:340) [jboss-invocation-1.5.0.Final.jar:1.5.0.Final]
	at org.jboss.invocation.ChainedInterceptor.processInvocation(ChainedInterceptor.java:61) [jboss-invocation-1.5.0.Final.jar:1.5.0.Final]
	at org.jboss.as.ee.component.ViewService$View.invoke(ViewService.java:198)
	at org.jboss.as.ee.component.ViewDescription$1.processInvocation(ViewDescription.java:185)
	at org.jboss.invocation.InterceptorContext.proceed(InterceptorContext.java:340) [jboss-invocation-1.5.0.Final.jar:1.5.0.Final]
	at org.jboss.invocation.ChainedInterceptor.processInvocation(ChainedInterceptor.java:61) [jboss-invocation-1.5.0.Final.jar:1.5.0.Final]
	at org.jboss.as.ee.component.ProxyInvocationHandler.invoke(ProxyInvocationHandler.java:73)
	at es.uvigo.esei.microstories.services.StoryService$$$view1.createStory(Unknown Source) [classes:]
	at sun.reflect.NativeMethodAccessorImpl.invoke0(Native Method) [rt.jar:1.8.0_144]
	at sun.reflect.NativeMethodAccessorImpl.invoke(NativeMethodAccessorImpl.java:62) [rt.jar:1.8.0_144]
	at sun.reflect.DelegatingMethodAccessorImpl.invoke(DelegatingMethodAccessorImpl.java:43) [rt.jar:1.8.0_144]
	at java.lang.reflect.Method.invoke(Method.java:498) [rt.jar:1.8.0_144]
	at org.jboss.weld.util.reflection.Reflections.invokeAndUnwrap(Reflections.java:433) [weld-core-impl-2.3.5.Final.jar:2.3.5.Final]
	at org.jboss.weld.bean.proxy.EnterpriseBeanProxyMethodHandler.invoke(EnterpriseBeanProxyMethodHandler.java:128) [weld-core-impl-2.3.5.Final.jar:2.3.5.Final]
	at org.jboss.weld.bean.proxy.EnterpriseTargetBeanInstance.invoke(EnterpriseTargetBeanInstance.java:56) [weld-core-impl-2.3.5.Final.jar:2.3.5.Final]
	at org.jboss.weld.bean.proxy.InjectionPointPropagatingEnterpriseTargetBeanInstance.invoke(InjectionPointPropagatingEnterpriseTargetBeanInstance.java:67) [weld-core-impl-2.3.5.Final.jar:2.3.5.Final]
	at org.jboss.weld.bean.proxy.ProxyMethodHandler.invoke(ProxyMethodHandler.java:100) [weld-core-impl-2.3.5.Final.jar:2.3.5.Final]
	at es.uvigo.esei.microstories.services.StoryService$Proxy$_$$_Weld$EnterpriseProxy$.createStory(Unknown Source) [classes:]
	at es.uvigo.esei.microstories.services.StoryServiceIntegrationTest.lambda$testCreateStory_Unauthorized_NoUser$7(StoryServiceIntegrationTest.java:417) [classes:]
	at es.uvigo.esei.dgss.teama.microstories.service.util.security.CreatorRoleCaller.call(CreatorRoleCaller.java:13) [classes:]
	at sun.reflect.NativeMethodAccessorImpl.invoke0(Native Method) [rt.jar:1.8.0_144]
	at sun.reflect.NativeMethodAccessorImpl.invoke(NativeMethodAccessorImpl.java:62) [rt.jar:1.8.0_144]
	at sun.reflect.DelegatingMethodAccessorImpl.invoke(DelegatingMethodAccessorImpl.java:43) [rt.jar:1.8.0_144]
	at java.lang.reflect.Method.invoke(Method.java:498) [rt.jar:1.8.0_144]
	at org.jboss.as.ee.component.ManagedReferenceMethodInterceptor.processInvocation(ManagedReferenceMethodInterceptor.java:52)
	at org.jboss.invocation.InterceptorContext.proceed(InterceptorContext.java:340) [jboss-invocation-1.5.0.Final.jar:1.5.0.Final]
	at org.jboss.invocation.InterceptorContext$Invocation.proceed(InterceptorContext.java:437) [jboss-invocation-1.5.0.Final.jar:1.5.0.Final]
	at org.jboss.as.weld.ejb.Jsr299BindingsInterceptor.doMethodInterception(Jsr299BindingsInterceptor.java:82) [wildfly-weld-10.1.0.Final.jar:10.1.0.Final]
	at org.jboss.as.weld.ejb.Jsr299BindingsInterceptor.processInvocation(Jsr299BindingsInterceptor.java:93) [wildfly-weld-10.1.0.Final.jar:10.1.0.Final]
	at org.jboss.as.ee.component.interceptors.UserInterceptorFactory$1.processInvocation(UserInterceptorFactory.java:63)
	at org.jboss.invocation.InterceptorContext.proceed(InterceptorContext.java:340) [jboss-invocation-1.5.0.Final.jar:1.5.0.Final]
	at org.jboss.as.ejb3.component.invocationmetrics.ExecutionTimeInterceptor.processInvocation(ExecutionTimeInterceptor.java:43) [wildfly-ejb3-10.1.0.Final.jar:10.1.0.Final]
	at org.jboss.invocation.InterceptorContext.proceed(InterceptorContext.java:340) [jboss-invocation-1.5.0.Final.jar:1.5.0.Final]
	at org.jboss.as.jpa.interceptor.SBInvocationInterceptor.processInvocation(SBInvocationInterceptor.java:47) [wildfly-jpa-10.1.0.Final.jar:10.1.0.Final]
	at org.jboss.invocation.InterceptorContext.proceed(InterceptorContext.java:340) [jboss-invocation-1.5.0.Final.jar:1.5.0.Final]
	at org.jboss.invocation.InterceptorContext$Invocation.proceed(InterceptorContext.java:437) [jboss-invocation-1.5.0.Final.jar:1.5.0.Final]
	at org.jboss.weld.ejb.AbstractEJBRequestScopeActivationInterceptor.aroundInvoke(AbstractEJBRequestScopeActivationInterceptor.java:64) [weld-core-impl-2.3.5.Final.jar:2.3.5.Final]
	at org.jboss.as.weld.ejb.EjbRequestScopeActivationInterceptor.processInvocation(EjbRequestScopeActivationInterceptor.java:83) [wildfly-weld-10.1.0.Final.jar:10.1.0.Final]
	at org.jboss.invocation.InterceptorContext.proceed(InterceptorContext.java:340) [jboss-invocation-1.5.0.Final.jar:1.5.0.Final]
	at org.jboss.as.ee.concurrent.ConcurrentContextInterceptor.processInvocation(ConcurrentContextInterceptor.java:45) [wildfly-ee-10.1.0.Final.jar:10.1.0.Final]
	at org.jboss.invocation.InterceptorContext.proceed(InterceptorContext.java:340) [jboss-invocation-1.5.0.Final.jar:1.5.0.Final]
	at org.jboss.invocation.InitialInterceptor.processInvocation(InitialInterceptor.java:21) [jboss-invocation-1.5.0.Final.jar:1.5.0.Final]
	at org.jboss.invocation.InterceptorContext.proceed(InterceptorContext.java:340) [jboss-invocation-1.5.0.Final.jar:1.5.0.Final]
	at org.jboss.invocation.ChainedInterceptor.processInvocation(ChainedInterceptor.java:61) [jboss-invocation-1.5.0.Final.jar:1.5.0.Final]
	at org.jboss.as.ee.component.interceptors.ComponentDispatcherInterceptor.processInvocation(ComponentDispatcherInterceptor.java:52)
	at org.jboss.invocation.InterceptorContext.proceed(InterceptorContext.java:340) [jboss-invocation-1.5.0.Final.jar:1.5.0.Final]
	at org.jboss.as.ejb3.component.interceptors.NonPooledEJBComponentInstanceAssociatingInterceptor.processInvocation(NonPooledEJBComponentInstanceAssociatingInterceptor.java:59) [wildfly-ejb3-10.1.0.Final.jar:10.1.0.Final]
	at org.jboss.invocation.InterceptorContext.proceed(InterceptorContext.java:340) [jboss-invocation-1.5.0.Final.jar:1.5.0.Final]
	at org.jboss.as.ejb3.tx.CMTTxInterceptor.invokeInCallerTx(CMTTxInterceptor.java:254) [wildfly-ejb3-10.1.0.Final.jar:10.1.0.Final]
	at org.jboss.as.ejb3.tx.CMTTxInterceptor.required(CMTTxInterceptor.java:329) [wildfly-ejb3-10.1.0.Final.jar:10.1.0.Final]
	at org.jboss.as.ejb3.tx.CMTTxInterceptor.processInvocation(CMTTxInterceptor.java:239) [wildfly-ejb3-10.1.0.Final.jar:10.1.0.Final]
	at org.jboss.invocation.InterceptorContext.proceed(InterceptorContext.java:340) [jboss-invocation-1.5.0.Final.jar:1.5.0.Final]
	at org.jboss.as.ejb3.component.interceptors.CurrentInvocationContextInterceptor.processInvocation(CurrentInvocationContextInterceptor.java:41) [wildfly-ejb3-10.1.0.Final.jar:10.1.0.Final]
	at org.jboss.invocation.InterceptorContext.proceed(InterceptorContext.java:340) [jboss-invocation-1.5.0.Final.jar:1.5.0.Final]
	at org.jboss.as.ejb3.component.invocationmetrics.WaitTimeInterceptor.processInvocation(WaitTimeInterceptor.java:47) [wildfly-ejb3-10.1.0.Final.jar:10.1.0.Final]
	at org.jboss.invocation.InterceptorContext.proceed(InterceptorContext.java:340) [jboss-invocation-1.5.0.Final.jar:1.5.0.Final]
	at org.jboss.as.ejb3.security.AuthorizationInterceptor.processInvocation(AuthorizationInterceptor.java:138) [wildfly-ejb3-10.1.0.Final.jar:10.1.0.Final]
	at org.jboss.invocation.InterceptorContext.proceed(InterceptorContext.java:340) [jboss-invocation-1.5.0.Final.jar:1.5.0.Final]
	at org.jboss.as.ejb3.security.SecurityContextInterceptor.processInvocation(SecurityContextInterceptor.java:100) [wildfly-ejb3-10.1.0.Final.jar:10.1.0.Final]
	at org.jboss.invocation.InterceptorContext.proceed(InterceptorContext.java:340) [jboss-invocation-1.5.0.Final.jar:1.5.0.Final]
	at org.jboss.as.ejb3.deployment.processors.StartupAwaitInterceptor.processInvocation(StartupAwaitInterceptor.java:22) [wildfly-ejb3-10.1.0.Final.jar:10.1.0.Final]
	at org.jboss.invocation.InterceptorContext.proceed(InterceptorContext.java:340) [jboss-invocation-1.5.0.Final.jar:1.5.0.Final]
	at org.jboss.as.ejb3.component.interceptors.ShutDownInterceptorFactory$1.processInvocation(ShutDownInterceptorFactory.java:64) [wildfly-ejb3-10.1.0.Final.jar:10.1.0.Final]
	at org.jboss.invocation.InterceptorContext.proceed(InterceptorContext.java:340) [jboss-invocation-1.5.0.Final.jar:1.5.0.Final]
	at org.jboss.as.ejb3.component.interceptors.LoggingInterceptor.processInvocation(LoggingInterceptor.java:67) [wildfly-ejb3-10.1.0.Final.jar:10.1.0.Final]
	at org.jboss.invocation.InterceptorContext.proceed(InterceptorContext.java:340) [jboss-invocation-1.5.0.Final.jar:1.5.0.Final]
	at org.jboss.as.ee.component.NamespaceContextInterceptor.processInvocation(NamespaceContextInterceptor.java:50)
	at org.jboss.invocation.InterceptorContext.proceed(InterceptorContext.java:340) [jboss-invocation-1.5.0.Final.jar:1.5.0.Final]
	at org.jboss.as.ejb3.component.interceptors.AdditionalSetupInterceptor.processInvocation(AdditionalSetupInterceptor.java:54) [wildfly-ejb3-10.1.0.Final.jar:10.1.0.Final]
	at org.jboss.invocation.InterceptorContext.proceed(InterceptorContext.java:340) [jboss-invocation-1.5.0.Final.jar:1.5.0.Final]
	at org.jboss.invocation.ContextClassLoaderInterceptor.processInvocation(ContextClassLoaderInterceptor.java:64) [jboss-invocation-1.5.0.Final.jar:1.5.0.Final]
	at org.jboss.invocation.InterceptorContext.proceed(InterceptorContext.java:340) [jboss-invocation-1.5.0.Final.jar:1.5.0.Final]
	at org.jboss.invocation.InterceptorContext.run(InterceptorContext.java:356) [jboss-invocation-1.5.0.Final.jar:1.5.0.Final]
	at org.wildfly.security.manager.WildFlySecurityManager.doChecked(WildFlySecurityManager.java:636) [wildfly-elytron-1.1.2.Final.jar:1.1.2.Final]
	at org.jboss.invocation.AccessCheckingInterceptor.processInvocation(AccessCheckingInterceptor.java:61) [jboss-invocation-1.5.0.Final.jar:1.5.0.Final]
	at org.jboss.invocation.InterceptorContext.proceed(InterceptorContext.java:340) [jboss-invocation-1.5.0.Final.jar:1.5.0.Final]
	at org.jboss.invocation.InterceptorContext.run(InterceptorContext.java:356) [jboss-invocation-1.5.0.Final.jar:1.5.0.Final]
	at org.jboss.invocation.PrivilegedWithCombinerInterceptor.processInvocation(PrivilegedWithCombinerInterceptor.java:80) [:1.5.0.Final]
	at org.jboss.invocation.InterceptorContext.proceed(InterceptorContext.java:340) [jboss-invocation-1.5.0.Final.jar:1.5.0.Final]
	at org.jboss.invocation.ChainedInterceptor.processInvocation(ChainedInterceptor.java:61) [jboss-invocation-1.5.0.Final.jar:1.5.0.Final]
	at org.jboss.as.ee.component.ViewService$View.invoke(ViewService.java:198)
	at org.jboss.as.ee.component.ViewDescription$1.processInvocation(ViewDescription.java:185)
	at org.jboss.invocation.InterceptorContext.proceed(InterceptorContext.java:340) [jboss-invocation-1.5.0.Final.jar:1.5.0.Final]
	at org.jboss.invocation.ChainedInterceptor.processInvocation(ChainedInterceptor.java:61) [jboss-invocation-1.5.0.Final.jar:1.5.0.Final]
	at org.jboss.as.ee.component.ProxyInvocationHandler.invoke(ProxyInvocationHandler.java:73)
	at es.uvigo.esei.dgss.teama.microstories.service.util.security.RoleCaller$$$view3.call(Unknown Source) [classes:]
	at es.uvigo.esei.microstories.services.StoryServiceIntegrationTest.testCreateStory_Unauthorized_NoUser(StoryServiceIntegrationTest.java:417) [classes:]
	at sun.reflect.NativeMethodAccessorImpl.invoke0(Native Method) [rt.jar:1.8.0_144]
	at sun.reflect.NativeMethodAccessorImpl.invoke(NativeMethodAccessorImpl.java:62) [rt.jar:1.8.0_144]
	at sun.reflect.DelegatingMethodAccessorImpl.invoke(DelegatingMethodAccessorImpl.java:43) [rt.jar:1.8.0_144]
	at java.lang.reflect.Method.invoke(Method.java:498) [rt.jar:1.8.0_144]
	at org.junit.runners.model.FrameworkMethod$1.runReflectiveCall(FrameworkMethod.java:50) [arquillian-junit.jar:]
	at org.junit.internal.runners.model.ReflectiveCallable.run(ReflectiveCallable.java:12) [arquillian-junit.jar:]
	at org.junit.runners.model.FrameworkMethod.invokeExplosively(FrameworkMethod.java:47) [arquillian-junit.jar:]
	at org.jboss.arquillian.junit.Arquillian$8$1.invoke(Arquillian.java:379) [arquillian-junit.jar:]
	at org.jboss.arquillian.container.test.impl.execution.LocalTestExecuter.execute(LocalTestExecuter.java:60) [arquillian-core.jar:]
	at sun.reflect.GeneratedMethodAccessor72.invoke(Unknown Source) [:1.8.0_144]
	at sun.reflect.DelegatingMethodAccessorImpl.invoke(DelegatingMethodAccessorImpl.java:43) [rt.jar:1.8.0_144]
	at java.lang.reflect.Method.invoke(Method.java:498) [rt.jar:1.8.0_144]
	at org.jboss.arquillian.core.impl.ObserverImpl.invoke(ObserverImpl.java:96) [arquillian-core.jar:]
	at org.jboss.arquillian.core.impl.EventContextImpl.invokeObservers(EventContextImpl.java:103) [arquillian-core.jar:]
	at org.jboss.arquillian.core.impl.EventContextImpl.proceed(EventContextImpl.java:85) [arquillian-core.jar:]
	at org.jboss.arquillian.core.impl.ManagerImpl.fire(ManagerImpl.java:143) [arquillian-core.jar:]
	at org.jboss.arquillian.core.impl.ManagerImpl.fire(ManagerImpl.java:114) [arquillian-core.jar:]
	at org.jboss.arquillian.core.impl.EventImpl.fire(EventImpl.java:67) [arquillian-core.jar:]
	at org.jboss.arquillian.container.test.impl.execution.ContainerTestExecuter.execute(ContainerTestExecuter.java:38) [arquillian-core.jar:]
	at sun.reflect.GeneratedMethodAccessor71.invoke(Unknown Source) [:1.8.0_144]
	at sun.reflect.DelegatingMethodAccessorImpl.invoke(DelegatingMethodAccessorImpl.java:43) [rt.jar:1.8.0_144]
	at java.lang.reflect.Method.invoke(Method.java:498) [rt.jar:1.8.0_144]
	at org.jboss.arquillian.core.impl.ObserverImpl.invoke(ObserverImpl.java:96) [arquillian-core.jar:]
	at org.jboss.arquillian.core.impl.EventContextImpl.invokeObservers(EventContextImpl.java:103) [arquillian-core.jar:]
	at org.jboss.arquillian.core.impl.EventContextImpl.proceed(EventContextImpl.java:85) [arquillian-core.jar:]
	at org.jboss.arquillian.test.impl.TestContextHandler.createTestContext(TestContextHandler.java:130) [arquillian-core.jar:]
	at sun.reflect.GeneratedMethodAccessor15.invoke(Unknown Source) [:1.8.0_144]
	at sun.reflect.DelegatingMethodAccessorImpl.invoke(DelegatingMethodAccessorImpl.java:43) [rt.jar:1.8.0_144]
	at java.lang.reflect.Method.invoke(Method.java:498) [rt.jar:1.8.0_144]
	at org.jboss.arquillian.core.impl.ObserverImpl.invoke(ObserverImpl.java:96) [arquillian-core.jar:]
	at org.jboss.arquillian.core.impl.EventContextImpl.proceed(EventContextImpl.java:92) [arquillian-core.jar:]
	at org.jboss.arquillian.test.impl.TestContextHandler.createClassContext(TestContextHandler.java:92) [arquillian-core.jar:]
	at sun.reflect.GeneratedMethodAccessor14.invoke(Unknown Source) [:1.8.0_144]
	at sun.reflect.DelegatingMethodAccessorImpl.invoke(DelegatingMethodAccessorImpl.java:43) [rt.jar:1.8.0_144]
	at java.lang.reflect.Method.invoke(Method.java:498) [rt.jar:1.8.0_144]
	at org.jboss.arquillian.core.impl.ObserverImpl.invoke(ObserverImpl.java:96) [arquillian-core.jar:]
	at org.jboss.arquillian.core.impl.EventContextImpl.proceed(EventContextImpl.java:92) [arquillian-core.jar:]
	at org.jboss.arquillian.test.impl.TestContextHandler.createSuiteContext(TestContextHandler.java:73) [arquillian-core.jar:]
	at sun.reflect.GeneratedMethodAccessor13.invoke(Unknown Source) [:1.8.0_144]
	at sun.reflect.DelegatingMethodAccessorImpl.invoke(DelegatingMethodAccessorImpl.java:43) [rt.jar:1.8.0_144]
	at java.lang.reflect.Method.invoke(Method.java:498) [rt.jar:1.8.0_144]
	at org.jboss.arquillian.core.impl.ObserverImpl.invoke(ObserverImpl.java:96) [arquillian-core.jar:]
	at org.jboss.arquillian.core.impl.EventContextImpl.proceed(EventContextImpl.java:92) [arquillian-core.jar:]
	at org.jboss.arquillian.core.impl.ManagerImpl.fire(ManagerImpl.java:143) [arquillian-core.jar:]
	at org.jboss.arquillian.test.impl.EventTestRunnerAdaptor.test(EventTestRunnerAdaptor.java:136) [arquillian-core.jar:]
	at org.jboss.arquillian.junit.Arquillian$8.evaluate(Arquillian.java:372) [arquillian-junit.jar:]
	at org.junit.internal.runners.statements.ExpectException.evaluate(ExpectException.java:19) [arquillian-junit.jar:]
	at org.jboss.arquillian.junit.Arquillian$4.evaluate(Arquillian.java:246) [arquillian-junit.jar:]
	at org.jboss.arquillian.junit.Arquillian.multiExecute(Arquillian.java:431) [arquillian-junit.jar:]
	at org.jboss.arquillian.junit.Arquillian.access$200(Arquillian.java:55) [arquillian-junit.jar:]
	at org.jboss.arquillian.junit.Arquillian$5.evaluate(Arquillian.java:260) [arquillian-junit.jar:]
	at org.jboss.arquillian.junit.Arquillian$7$1.invoke(Arquillian.java:324) [arquillian-junit.jar:]
	at org.jboss.arquillian.container.test.impl.execution.BeforeLifecycleEventExecuter.on(BeforeLifecycleEventExecuter.java:35) [arquillian-core.jar:]
	at sun.reflect.GeneratedMethodAccessor21.invoke(Unknown Source) [:1.8.0_144]
	at sun.reflect.DelegatingMethodAccessorImpl.invoke(DelegatingMethodAccessorImpl.java:43) [rt.jar:1.8.0_144]
	at java.lang.reflect.Method.invoke(Method.java:498) [rt.jar:1.8.0_144]
	at org.jboss.arquillian.core.impl.ObserverImpl.invoke(ObserverImpl.java:96) [arquillian-core.jar:]
	at org.jboss.arquillian.core.impl.EventContextImpl.invokeObservers(EventContextImpl.java:103) [arquillian-core.jar:]
	at org.jboss.arquillian.core.impl.EventContextImpl.proceed(EventContextImpl.java:85) [arquillian-core.jar:]
	at org.jboss.arquillian.test.impl.TestContextHandler.createTestContext(TestContextHandler.java:130) [arquillian-core.jar:]
	at sun.reflect.GeneratedMethodAccessor15.invoke(Unknown Source) [:1.8.0_144]
	at sun.reflect.DelegatingMethodAccessorImpl.invoke(DelegatingMethodAccessorImpl.java:43) [rt.jar:1.8.0_144]
	at java.lang.reflect.Method.invoke(Method.java:498) [rt.jar:1.8.0_144]
	at org.jboss.arquillian.core.impl.ObserverImpl.invoke(ObserverImpl.java:96) [arquillian-core.jar:]
	at org.jboss.arquillian.core.impl.EventContextImpl.proceed(EventContextImpl.java:92) [arquillian-core.jar:]
	at org.jboss.arquillian.test.impl.TestContextHandler.createClassContext(TestContextHandler.java:92) [arquillian-core.jar:]
	at sun.reflect.GeneratedMethodAccessor14.invoke(Unknown Source) [:1.8.0_144]
	at sun.reflect.DelegatingMethodAccessorImpl.invoke(DelegatingMethodAccessorImpl.java:43) [rt.jar:1.8.0_144]
	at java.lang.reflect.Method.invoke(Method.java:498) [rt.jar:1.8.0_144]
	at org.jboss.arquillian.core.impl.ObserverImpl.invoke(ObserverImpl.java:96) [arquillian-core.jar:]
	at org.jboss.arquillian.core.impl.EventContextImpl.proceed(EventContextImpl.java:92) [arquillian-core.jar:]
	at org.jboss.arquillian.test.impl.TestContextHandler.createSuiteContext(TestContextHandler.java:73) [arquillian-core.jar:]
	at sun.reflect.GeneratedMethodAccessor13.invoke(Unknown Source) [:1.8.0_144]
	at sun.reflect.DelegatingMethodAccessorImpl.invoke(DelegatingMethodAccessorImpl.java:43) [rt.jar:1.8.0_144]
	at java.lang.reflect.Method.invoke(Method.java:498) [rt.jar:1.8.0_144]
	at org.jboss.arquillian.core.impl.ObserverImpl.invoke(ObserverImpl.java:96) [arquillian-core.jar:]
	at org.jboss.arquillian.core.impl.EventContextImpl.proceed(EventContextImpl.java:92) [arquillian-core.jar:]
	at org.jboss.arquillian.core.impl.ManagerImpl.fire(ManagerImpl.java:143) [arquillian-core.jar:]
	at org.jboss.arquillian.core.impl.ManagerImpl.fire(ManagerImpl.java:114) [arquillian-core.jar:]
	at org.jboss.arquillian.test.impl.EventTestRunnerAdaptor.fireCustomLifecycle(EventTestRunnerAdaptor.java:159) [arquillian-core.jar:]
	at org.jboss.arquillian.junit.Arquillian$7.evaluate(Arquillian.java:317) [arquillian-junit.jar:]
	at org.junit.runners.ParentRunner.runLeaf(ParentRunner.java:325) [arquillian-junit.jar:]
	at org.junit.runners.BlockJUnit4ClassRunner.runChild(BlockJUnit4ClassRunner.java:78) [arquillian-junit.jar:]
	at org.junit.runners.BlockJUnit4ClassRunner.runChild(BlockJUnit4ClassRunner.java:57) [arquillian-junit.jar:]
	at org.junit.runners.ParentRunner$3.run(ParentRunner.java:290) [arquillian-junit.jar:]
	at org.junit.runners.ParentRunner$1.schedule(ParentRunner.java:71) [arquillian-junit.jar:]
	at org.junit.runners.ParentRunner.runChildren(ParentRunner.java:288) [arquillian-junit.jar:]
	at org.junit.runners.ParentRunner.access$000(ParentRunner.java:58) [arquillian-junit.jar:]
	at org.junit.runners.ParentRunner$2.evaluate(ParentRunner.java:268) [arquillian-junit.jar:]
	at org.jboss.arquillian.junit.Arquillian$2.evaluate(Arquillian.java:205) [arquillian-junit.jar:]
	at org.jboss.arquillian.junit.Arquillian.multiExecute(Arquillian.java:431) [arquillian-junit.jar:]
	at org.jboss.arquillian.junit.Arquillian.access$200(Arquillian.java:55) [arquillian-junit.jar:]
	at org.jboss.arquillian.junit.Arquillian$3.evaluate(Arquillian.java:219) [arquillian-junit.jar:]
	at org.junit.runners.ParentRunner.run(ParentRunner.java:363) [arquillian-junit.jar:]
	at org.jboss.arquillian.junit.Arquillian.run(Arquillian.java:167) [arquillian-junit.jar:]
	at org.junit.runner.JUnitCore.run(JUnitCore.java:137) [arquillian-junit.jar:]
	at org.junit.runner.JUnitCore.run(JUnitCore.java:115) [arquillian-junit.jar:]
	at org.jboss.arquillian.junit.container.JUnitTestRunner.execute(JUnitTestRunner.java:66) [arquillian-junit.jar:]
	at org.jboss.arquillian.protocol.servlet.runner.ServletTestRunner.executeTest(ServletTestRunner.java:170) [arquillian-protocol.jar:]
	at org.jboss.arquillian.protocol.servlet.runner.ServletTestRunner.execute(ServletTestRunner.java:135) [arquillian-protocol.jar:]
	at org.jboss.arquillian.protocol.servlet.runner.ServletTestRunner.doGet(ServletTestRunner.java:98) [arquillian-protocol.jar:]
	at javax.servlet.http.HttpServlet.service(HttpServlet.java:687) [jboss-servlet-api_3.1_spec-1.0.0.Final.jar:1.0.0.Final]
	at javax.servlet.http.HttpServlet.service(HttpServlet.java:790) [jboss-servlet-api_3.1_spec-1.0.0.Final.jar:1.0.0.Final]
	at io.undertow.servlet.handlers.ServletHandler.handleRequest(ServletHandler.java:85) [undertow-servlet-1.4.0.Final.jar:1.4.0.Final]
	at io.undertow.servlet.handlers.security.ServletSecurityRoleHandler.handleRequest(ServletSecurityRoleHandler.java:62) [undertow-servlet-1.4.0.Final.jar:1.4.0.Final]
	at io.undertow.servlet.handlers.ServletDispatchingHandler.handleRequest(ServletDispatchingHandler.java:36) [undertow-servlet-1.4.0.Final.jar:1.4.0.Final]
	at org.wildfly.extension.undertow.security.SecurityContextAssociationHandler.handleRequest(SecurityContextAssociationHandler.java:78)
	at io.undertow.server.handlers.PredicateHandler.handleRequest(PredicateHandler.java:43) [undertow-core-1.4.0.Final.jar:1.4.0.Final]
	at io.undertow.servlet.handlers.security.SSLInformationAssociationHandler.handleRequest(SSLInformationAssociationHandler.java:131) [undertow-servlet-1.4.0.Final.jar:1.4.0.Final]
	at io.undertow.servlet.handlers.security.ServletAuthenticationCallHandler.handleRequest(ServletAuthenticationCallHandler.java:57) [undertow-servlet-1.4.0.Final.jar:1.4.0.Final]
	at io.undertow.server.handlers.PredicateHandler.handleRequest(PredicateHandler.java:43) [undertow-core-1.4.0.Final.jar:1.4.0.Final]
	at io.undertow.security.handlers.AbstractConfidentialityHandler.handleRequest(AbstractConfidentialityHandler.java:46) [undertow-core-1.4.0.Final.jar:1.4.0.Final]
	at io.undertow.servlet.handlers.security.ServletConfidentialityConstraintHandler.handleRequest(ServletConfidentialityConstraintHandler.java:64) [undertow-servlet-1.4.0.Final.jar:1.4.0.Final]
	at io.undertow.security.handlers.AuthenticationMechanismsHandler.handleRequest(AuthenticationMechanismsHandler.java:60) [undertow-core-1.4.0.Final.jar:1.4.0.Final]
	at io.undertow.servlet.handlers.security.CachedAuthenticatedSessionHandler.handleRequest(CachedAuthenticatedSessionHandler.java:77) [undertow-servlet-1.4.0.Final.jar:1.4.0.Final]
	at io.undertow.security.handlers.NotificationReceiverHandler.handleRequest(NotificationReceiverHandler.java:50) [undertow-core-1.4.0.Final.jar:1.4.0.Final]
	at io.undertow.security.handlers.AbstractSecurityContextAssociationHandler.handleRequest(AbstractSecurityContextAssociationHandler.java:43) [undertow-core-1.4.0.Final.jar:1.4.0.Final]
	at io.undertow.server.handlers.PredicateHandler.handleRequest(PredicateHandler.java:43) [undertow-core-1.4.0.Final.jar:1.4.0.Final]
	at org.wildfly.extension.undertow.security.jacc.JACCContextIdHandler.handleRequest(JACCContextIdHandler.java:61)
	at io.undertow.server.handlers.PredicateHandler.handleRequest(PredicateHandler.java:43) [undertow-core-1.4.0.Final.jar:1.4.0.Final]
	at io.undertow.server.handlers.PredicateHandler.handleRequest(PredicateHandler.java:43) [undertow-core-1.4.0.Final.jar:1.4.0.Final]
	at io.undertow.servlet.handlers.ServletInitialHandler.handleFirstRequest(ServletInitialHandler.java:292) [undertow-servlet-1.4.0.Final.jar:1.4.0.Final]
	at io.undertow.servlet.handlers.ServletInitialHandler.access$100(ServletInitialHandler.java:81) [undertow-servlet-1.4.0.Final.jar:1.4.0.Final]
	at io.undertow.servlet.handlers.ServletInitialHandler$2.call(ServletInitialHandler.java:138) [undertow-servlet-1.4.0.Final.jar:1.4.0.Final]
	at io.undertow.servlet.handlers.ServletInitialHandler$2.call(ServletInitialHandler.java:135) [undertow-servlet-1.4.0.Final.jar:1.4.0.Final]
	at io.undertow.servlet.core.ServletRequestContextThreadSetupAction$1.call(ServletRequestContextThreadSetupAction.java:48) [undertow-servlet-1.4.0.Final.jar:1.4.0.Final]
	at io.undertow.servlet.core.ContextClassLoaderSetupAction$1.call(ContextClassLoaderSetupAction.java:43) [undertow-servlet-1.4.0.Final.jar:1.4.0.Final]
	at io.undertow.servlet.api.LegacyThreadSetupActionWrapper$1.call(LegacyThreadSetupActionWrapper.java:44) [undertow-servlet-1.4.0.Final.jar:1.4.0.Final]
	at io.undertow.servlet.api.LegacyThreadSetupActionWrapper$1.call(LegacyThreadSetupActionWrapper.java:44) [undertow-servlet-1.4.0.Final.jar:1.4.0.Final]
	at io.undertow.servlet.api.LegacyThreadSetupActionWrapper$1.call(LegacyThreadSetupActionWrapper.java:44) [undertow-servlet-1.4.0.Final.jar:1.4.0.Final]
	at io.undertow.servlet.api.LegacyThreadSetupActionWrapper$1.call(LegacyThreadSetupActionWrapper.java:44) [undertow-servlet-1.4.0.Final.jar:1.4.0.Final]
	at io.undertow.servlet.api.LegacyThreadSetupActionWrapper$1.call(LegacyThreadSetupActionWrapper.java:44) [undertow-servlet-1.4.0.Final.jar:1.4.0.Final]
	at io.undertow.servlet.api.LegacyThreadSetupActionWrapper$1.call(LegacyThreadSetupActionWrapper.java:44) [undertow-servlet-1.4.0.Final.jar:1.4.0.Final]
	at io.undertow.servlet.handlers.ServletInitialHandler.dispatchRequest(ServletInitialHandler.java:272) [undertow-servlet-1.4.0.Final.jar:1.4.0.Final]
	at io.undertow.servlet.handlers.ServletInitialHandler.access$000(ServletInitialHandler.java:81) [undertow-servlet-1.4.0.Final.jar:1.4.0.Final]
	at io.undertow.servlet.handlers.ServletInitialHandler$1.handleRequest(ServletInitialHandler.java:104) [undertow-servlet-1.4.0.Final.jar:1.4.0.Final]
	at io.undertow.server.Connectors.executeRootHandler(Connectors.java:202) [undertow-core-1.4.0.Final.jar:1.4.0.Final]
	at io.undertow.server.HttpServerExchange$1.run(HttpServerExchange.java:805) [undertow-core-1.4.0.Final.jar:1.4.0.Final]
	at java.util.concurrent.ThreadPoolExecutor.runWorker(ThreadPoolExecutor.java:1149) [rt.jar:1.8.0_144]
	at java.util.concurrent.ThreadPoolExecutor$Worker.run(ThreadPoolExecutor.java:624) [rt.jar:1.8.0_144]
	at java.lang.Thread.run(Thread.java:748) [rt.jar:1.8.0_144]
Caused by: javax.persistence.NoResultException: No entity found for query
	at org.hibernate.jpa.internal.QueryImpl.getSingleResult(QueryImpl.java:532) [hibernate-entitymanager-5.0.10.Final.jar:5.0.10.Final]
	at es.uvigo.esei.microstories.services.UserService.getCurrentUser(UserService.java:32) [classes:]
	at sun.reflect.GeneratedMethodAccessor92.invoke(Unknown Source) [:1.8.0_144]
	at sun.reflect.DelegatingMethodAccessorImpl.invoke(DelegatingMethodAccessorImpl.java:43) [rt.jar:1.8.0_144]
	at java.lang.reflect.Method.invoke(Method.java:498) [rt.jar:1.8.0_144]
	at org.jboss.as.ee.component.ManagedReferenceMethodInterceptor.processInvocation(ManagedReferenceMethodInterceptor.java:52)
	at org.jboss.invocation.InterceptorContext.proceed(InterceptorContext.java:340) [jboss-invocation-1.5.0.Final.jar:1.5.0.Final]
	at org.jboss.invocation.InterceptorContext$Invocation.proceed(InterceptorContext.java:437) [jboss-invocation-1.5.0.Final.jar:1.5.0.Final]
	at org.jboss.as.weld.ejb.Jsr299BindingsInterceptor.doMethodInterception(Jsr299BindingsInterceptor.java:82) [wildfly-weld-10.1.0.Final.jar:10.1.0.Final]
	at org.jboss.as.weld.ejb.Jsr299BindingsInterceptor.processInvocation(Jsr299BindingsInterceptor.java:93) [wildfly-weld-10.1.0.Final.jar:10.1.0.Final]
	at org.jboss.as.ee.component.interceptors.UserInterceptorFactory$1.processInvocation(UserInterceptorFactory.java:63)
	at org.jboss.invocation.InterceptorContext.proceed(InterceptorContext.java:340) [jboss-invocation-1.5.0.Final.jar:1.5.0.Final]
	at org.jboss.as.ejb3.component.invocationmetrics.ExecutionTimeInterceptor.processInvocation(ExecutionTimeInterceptor.java:43) [wildfly-ejb3-10.1.0.Final.jar:10.1.0.Final]
	at org.jboss.invocation.InterceptorContext.proceed(InterceptorContext.java:340) [jboss-invocation-1.5.0.Final.jar:1.5.0.Final]
	at org.jboss.as.jpa.interceptor.SBInvocationInterceptor.processInvocation(SBInvocationInterceptor.java:47) [wildfly-jpa-10.1.0.Final.jar:10.1.0.Final]
	at org.jboss.invocation.InterceptorContext.proceed(InterceptorContext.java:340) [jboss-invocation-1.5.0.Final.jar:1.5.0.Final]
	at org.jboss.invocation.InterceptorContext$Invocation.proceed(InterceptorContext.java:437) [jboss-invocation-1.5.0.Final.jar:1.5.0.Final]
	at org.jboss.weld.ejb.AbstractEJBRequestScopeActivationInterceptor.aroundInvoke(AbstractEJBRequestScopeActivationInterceptor.java:64) [weld-core-impl-2.3.5.Final.jar:2.3.5.Final]
	at org.jboss.as.weld.ejb.EjbRequestScopeActivationInterceptor.processInvocation(EjbRequestScopeActivationInterceptor.java:83) [wildfly-weld-10.1.0.Final.jar:10.1.0.Final]
	at org.jboss.invocation.InterceptorContext.proceed(InterceptorContext.java:340) [jboss-invocation-1.5.0.Final.jar:1.5.0.Final]
	at org.jboss.as.ee.concurrent.ConcurrentContextInterceptor.processInvocation(ConcurrentContextInterceptor.java:45) [wildfly-ee-10.1.0.Final.jar:10.1.0.Final]
	at org.jboss.invocation.InterceptorContext.proceed(InterceptorContext.java:340) [jboss-invocation-1.5.0.Final.jar:1.5.0.Final]
	at org.jboss.invocation.InitialInterceptor.processInvocation(InitialInterceptor.java:21) [jboss-invocation-1.5.0.Final.jar:1.5.0.Final]
	at org.jboss.invocation.InterceptorContext.proceed(InterceptorContext.java:340) [jboss-invocation-1.5.0.Final.jar:1.5.0.Final]
	at org.jboss.invocation.ChainedInterceptor.processInvocation(ChainedInterceptor.java:61) [jboss-invocation-1.5.0.Final.jar:1.5.0.Final]
	at org.jboss.as.ee.component.interceptors.ComponentDispatcherInterceptor.processInvocation(ComponentDispatcherInterceptor.java:52)
	at org.jboss.invocation.InterceptorContext.proceed(InterceptorContext.java:340) [jboss-invocation-1.5.0.Final.jar:1.5.0.Final]
	at org.jboss.as.ejb3.component.interceptors.NonPooledEJBComponentInstanceAssociatingInterceptor.processInvocation(NonPooledEJBComponentInstanceAssociatingInterceptor.java:59) [wildfly-ejb3-10.1.0.Final.jar:10.1.0.Final]
	at org.jboss.invocation.InterceptorContext.proceed(InterceptorContext.java:340) [jboss-invocation-1.5.0.Final.jar:1.5.0.Final]
	at org.jboss.as.ejb3.tx.CMTTxInterceptor.invokeInCallerTx(CMTTxInterceptor.java:254) [wildfly-ejb3-10.1.0.Final.jar:10.1.0.Final]
	... 333 more

Hibernate: select user0_.id as id1_3_, user0_.password as password2_3_, user0_.role as role3_3_, user0_.username as username4_3_ from user user0_ where user0_.username=?
Hibernate: select story0_.id as id1_0_0_, story0_.author as author6_0_0_, story0_.content as content2_0_0_, story0_.genre as genre3_0_0_, story0_.published_at as publishe4_0_0_, story0_.title as title5_0_0_, user1_.id as id1_3_1_, user1_.password as password2_3_1_, user1_.role as role3_3_1_, user1_.username as username4_3_1_ from story story0_ inner join user user1_ on story0_.author=user1_.id where story0_.id=?
Hibernate: select story0_.id as id1_0_0_, story0_.author as author6_0_0_, story0_.content as content2_0_0_, story0_.genre as genre3_0_0_, story0_.published_at as publishe4_0_0_, story0_.title as title5_0_0_, user1_.id as id1_3_1_, user1_.password as password2_3_1_, user1_.role as role3_3_1_, user1_.username as username4_3_1_ from story story0_ inner join user user1_ on story0_.author=user1_.id where story0_.id=?
12:00:22,233 INFO  [org.wildfly.extension.undertow] (ServerService Thread Pool -- 64) WFLYUT0022: Unregistered web context: /test
12:00:22,514 INFO  [org.jboss.as.jpa] (ServerService Thread Pool -- 68) WFLYJPA0011: Stopping Persistence Unit (phase 2 of 2) Service 'test.war#test'
12:00:22,535 INFO  [org.hibernate.tool.hbm2ddl.SchemaExport] (ServerService Thread Pool -- 68) HHH000227: Running hbm2ddl schema export
Hibernate: drop table story if exists
Hibernate: drop table story_themes if exists
Hibernate: drop table story_views if exists
Hibernate: drop table user if exists
Hibernate: drop table user_favorites if exists
12:00:22,560 INFO  [org.hibernate.tool.hbm2ddl.SchemaExport] (ServerService Thread Pool -- 68) HHH000230: Schema export complete
12:00:22,565 INFO  [org.jboss.as.jpa] (ServerService Thread Pool -- 69) WFLYJPA0011: Stopping Persistence Unit (phase 1 of 2) Service 'test.war#test'
12:00:22,640 INFO  [org.jboss.as.clustering.infinispan] (ServerService Thread Pool -- 68) WFLYCLINF0003: Stopped client-mappings cache from ejb container
12:00:22,725 INFO  [org.jboss.as.server.deployment] (MSC service thread 1-1) WFLYSRV0028: Stopped deployment test.war (runtime-name: test.war) in 527ms
12:00:22,798 WARN  [org.jboss.as.controller] (management-handler-thread - 3) WFLYCTL0357: Notification of type deployment-undeployed is not described for the resource at the address []
12:00:22,814 INFO  [org.jboss.as.repository] (management-handler-thread - 3) WFLYDR0002: Content removed from location /var/lib/jenkins/workspace/microstories-2526-teamA/service/target/wildfly-10.1.0.Final/standalone/data/content/0b/4ddc7397fa596560a257a9a009eb4daa7894c8/content
12:00:22,815 INFO  [org.jboss.as.server] (management-handler-thread - 3) WFLYSRV0009: Undeployed "test.war" (runtime-name: "test.war")
[INFO] Tests run: 57, Failures: 0, Errors: 0, Skipped: 0, Time elapsed: 64.066 s - in es.uvigo.esei.microstories.services.ServiceIntegrationTestSuite
12:00:22,893 WARNING [org.jboss.arquillian.core.spi.ObserverMethod] (main) Argument 2 for ArquillianServiceDeployer.undeploy is null. It won't be invoked.
12:00:22,963 INFO  [org.jboss.as.connector.subsystems.datasources] (MSC service thread 1-4) WFLYJCA0010: Unbound data source [java:jboss/datasources/dgss2526/teamA/microstories]
12:00:22,964 INFO  [org.jboss.as.connector.subsystems.datasources] (MSC service thread 1-3) WFLYJCA0010: Unbound data source [java:jboss/datasources/ExampleDS]
12:00:23,216 INFO  [org.jboss.as.connector.deployers.jdbc] (MSC service thread 1-4) WFLYJCA0019: Stopped Driver service with driver-name = h2
12:00:23,243 INFO  [org.wildfly.extension.undertow] (MSC service thread 1-2) WFLYUT0019: Host default-host stopping
12:00:23,326 INFO  [org.wildfly.extension.undertow] (MSC service thread 1-4) WFLYUT0008: Undertow HTTP listener default suspending
12:00:23,340 INFO  [org.wildfly.extension.undertow] (MSC service thread 1-4) WFLYUT0007: Undertow HTTP listener default stopped, was bound to 127.0.0.1:28080
12:00:23,402 INFO  [org.wildfly.extension.undertow] (MSC service thread 1-4) WFLYUT0004: Undertow 1.4.0.Final stopping
12:00:23,647 INFO  [org.jboss.as] (MSC service thread 1-3) WFLYSRV0050: WildFly Full 10.1.0.Final (WildFly Core 2.2.0.Final) stopped in 506ms
[INFO] 
[INFO] Results:
[INFO] 
[INFO] Tests run: 57, Failures: 0, Errors: 0, Skipped: 0
[INFO] 
[JENKINS] Recording test results
[INFO] 
[INFO] --- jacoco-maven-plugin:0.7.9:report (post-unit-test) @ dgss2526-teamA-microstories-service ---
[INFO] Loading execution data file /var/lib/jenkins/workspace/microstories-2526-teamA/service/target/jacoco.exec
[INFO] Analyzed bundle 'Service' with 7 classes
[INFO] 
[INFO] --- maven-jar-plugin:3.0.2:jar (default-jar) @ dgss2526-teamA-microstories-service ---
[INFO] Building jar: /var/lib/jenkins/workspace/microstories-2526-teamA/service/target/dgss2526-teamA-microstories-service-0.1.0-SNAPSHOT.jar
[INFO] 
[INFO] >>> maven-source-plugin:3.0.1:jar (attach-sources) > generate-sources @ dgss2526-teamA-microstories-service >>>
[INFO] 
[INFO] --- jacoco-maven-plugin:0.7.9:prepare-agent (pre-unit-test) @ dgss2526-teamA-microstories-service ---
[INFO] argLine set to -javaagent:/var/lib/jenkins/.m2/repository/org/jacoco/org.jacoco.agent/0.7.9/org.jacoco.agent-0.7.9-runtime.jar=destfile=/var/lib/jenkins/workspace/microstories-2526-teamA/service/target/jacoco.exec,classdumpdir=/var/lib/jenkins/workspace/microstories-2526-teamA/target/classes
[WARNING] Failed to getClass for org.apache.maven.plugins.source.SourceJarMojo
[INFO] 
[INFO] <<< maven-source-plugin:3.0.1:jar (attach-sources) < generate-sources @ dgss2526-teamA-microstories-service <<<
[INFO] 
[INFO] 
[INFO] --- maven-source-plugin:3.0.1:jar (attach-sources) @ dgss2526-teamA-microstories-service ---
[INFO] Building jar: /var/lib/jenkins/workspace/microstories-2526-teamA/service/target/dgss2526-teamA-microstories-service-0.1.0-SNAPSHOT-sources.jar
[INFO] 
[INFO] --- maven-javadoc-plugin:2.10.4:jar (attach-javadocs) @ dgss2526-teamA-microstories-service ---
[INFO] 
Loading source files for package es.uvigo.esei.microstories.services.exceptions...
Loading source files for package es.uvigo.esei.microstories.services...
Loading source files for package es.uvigo.esei.microstories.dtos...
Loading source files for package es.uvigo.esei.microstories.mappers...
Constructing Javadoc information...
Standard Doclet version 1.8.0_144
Building tree for all the packages and classes...
Generating /var/lib/jenkins/workspace/microstories-2526-teamA/service/target/apidocs/es/uvigo/esei/microstories/services/exceptions/EntityNotFoundException.html...
Generating /var/lib/jenkins/workspace/microstories-2526-teamA/service/target/apidocs/es/uvigo/esei/microstories/services/exceptions/UnauthorizedAccessException.html...
Generating /var/lib/jenkins/workspace/microstories-2526-teamA/service/target/apidocs/es/uvigo/esei/microstories/services/StoryService.html...
Generating /var/lib/jenkins/workspace/microstories-2526-teamA/service/target/apidocs/es/uvigo/esei/microstories/services/UserService.html...
Generating /var/lib/jenkins/workspace/microstories-2526-teamA/service/target/apidocs/es/uvigo/esei/microstories/dtos/StoryCreateDto.html...
Generating /var/lib/jenkins/workspace/microstories-2526-teamA/service/target/apidocs/es/uvigo/esei/microstories/dtos/StoryResponseDto.html...
Generating /var/lib/jenkins/workspace/microstories-2526-teamA/service/target/apidocs/es/uvigo/esei/microstories/mappers/StoryMapper.html...
Generating /var/lib/jenkins/workspace/microstories-2526-teamA/service/target/apidocs/overview-frame.html...
Generating /var/lib/jenkins/workspace/microstories-2526-teamA/service/target/apidocs/es/uvigo/esei/microstories/dtos/package-frame.html...
Generating /var/lib/jenkins/workspace/microstories-2526-teamA/service/target/apidocs/es/uvigo/esei/microstories/dtos/package-summary.html...
Generating /var/lib/jenkins/workspace/microstories-2526-teamA/service/target/apidocs/es/uvigo/esei/microstories/dtos/package-tree.html...
Generating /var/lib/jenkins/workspace/microstories-2526-teamA/service/target/apidocs/es/uvigo/esei/microstories/mappers/package-frame.html...
Generating /var/lib/jenkins/workspace/microstories-2526-teamA/service/target/apidocs/es/uvigo/esei/microstories/mappers/package-summary.html...
Generating /var/lib/jenkins/workspace/microstories-2526-teamA/service/target/apidocs/es/uvigo/esei/microstories/mappers/package-tree.html...
Generating /var/lib/jenkins/workspace/microstories-2526-teamA/service/target/apidocs/es/uvigo/esei/microstories/services/package-frame.html...
Generating /var/lib/jenkins/workspace/microstories-2526-teamA/service/target/apidocs/es/uvigo/esei/microstories/services/package-summary.html...
Generating /var/lib/jenkins/workspace/microstories-2526-teamA/service/target/apidocs/es/uvigo/esei/microstories/services/package-tree.html...
Generating /var/lib/jenkins/workspace/microstories-2526-teamA/service/target/apidocs/es/uvigo/esei/microstories/services/exceptions/package-frame.html...
Generating /var/lib/jenkins/workspace/microstories-2526-teamA/service/target/apidocs/es/uvigo/esei/microstories/services/exceptions/package-summary.html...
Generating /var/lib/jenkins/workspace/microstories-2526-teamA/service/target/apidocs/es/uvigo/esei/microstories/services/exceptions/package-tree.html...
Generating /var/lib/jenkins/workspace/microstories-2526-teamA/service/target/apidocs/constant-values.html...
Generating /var/lib/jenkins/workspace/microstories-2526-teamA/service/target/apidocs/serialized-form.html...
Generating /var/lib/jenkins/workspace/microstories-2526-teamA/service/target/apidocs/es/uvigo/esei/microstories/services/exceptions/class-use/UnauthorizedAccessException.html...
Generating /var/lib/jenkins/workspace/microstories-2526-teamA/service/target/apidocs/es/uvigo/esei/microstories/services/exceptions/class-use/EntityNotFoundException.html...
Generating /var/lib/jenkins/workspace/microstories-2526-teamA/service/target/apidocs/es/uvigo/esei/microstories/services/class-use/UserService.html...
Generating /var/lib/jenkins/workspace/microstories-2526-teamA/service/target/apidocs/es/uvigo/esei/microstories/services/class-use/StoryService.html...
Generating /var/lib/jenkins/workspace/microstories-2526-teamA/service/target/apidocs/es/uvigo/esei/microstories/dtos/class-use/StoryCreateDto.html...
Generating /var/lib/jenkins/workspace/microstories-2526-teamA/service/target/apidocs/es/uvigo/esei/microstories/dtos/class-use/StoryResponseDto.html...
Generating /var/lib/jenkins/workspace/microstories-2526-teamA/service/target/apidocs/es/uvigo/esei/microstories/mappers/class-use/StoryMapper.html...
Generating /var/lib/jenkins/workspace/microstories-2526-teamA/service/target/apidocs/es/uvigo/esei/microstories/dtos/package-use.html...
Generating /var/lib/jenkins/workspace/microstories-2526-teamA/service/target/apidocs/es/uvigo/esei/microstories/mappers/package-use.html...
Generating /var/lib/jenkins/workspace/microstories-2526-teamA/service/target/apidocs/es/uvigo/esei/microstories/services/package-use.html...
Generating /var/lib/jenkins/workspace/microstories-2526-teamA/service/target/apidocs/es/uvigo/esei/microstories/services/exceptions/package-use.html...
Building index for all the packages and classes...
Generating /var/lib/jenkins/workspace/microstories-2526-teamA/service/target/apidocs/overview-tree.html...
Generating /var/lib/jenkins/workspace/microstories-2526-teamA/service/target/apidocs/index-all.html...
Generating /var/lib/jenkins/workspace/microstories-2526-teamA/service/target/apidocs/deprecated-list.html...
Building index for all classes...
Generating /var/lib/jenkins/workspace/microstories-2526-teamA/service/target/apidocs/allclasses-frame.html...
Generating /var/lib/jenkins/workspace/microstories-2526-teamA/service/target/apidocs/allclasses-noframe.html...
Generating /var/lib/jenkins/workspace/microstories-2526-teamA/service/target/apidocs/index.html...
Generating /var/lib/jenkins/workspace/microstories-2526-teamA/service/target/apidocs/overview-summary.html...
Generating /var/lib/jenkins/workspace/microstories-2526-teamA/service/target/apidocs/help-doc.html...
[INFO] Building jar: /var/lib/jenkins/workspace/microstories-2526-teamA/service/target/dgss2526-teamA-microstories-service-0.1.0-SNAPSHOT-javadoc.jar
[INFO] 
[INFO] --- maven-jar-plugin:3.0.2:test-jar (default) @ dgss2526-teamA-microstories-service ---
[INFO] Building jar: /var/lib/jenkins/workspace/microstories-2526-teamA/service/target/dgss2526-teamA-microstories-service-0.1.0-SNAPSHOT-tests.jar
[INFO] 
[INFO] --- jacoco-maven-plugin:0.7.9:prepare-agent (pre-integration-test) @ dgss2526-teamA-microstories-service ---
[INFO] argLine set to -javaagent:/var/lib/jenkins/.m2/repository/org/jacoco/org.jacoco.agent/0.7.9/org.jacoco.agent-0.7.9-runtime.jar=destfile=/var/lib/jenkins/workspace/microstories-2526-teamA/service/target/jacoco.exec,classdumpdir=/var/lib/jenkins/workspace/microstories-2526-teamA/target/classes
[INFO] 
[INFO] --- jacoco-maven-plugin:0.7.9:report (post-integration-test) @ dgss2526-teamA-microstories-service ---
[INFO] Loading execution data file /var/lib/jenkins/workspace/microstories-2526-teamA/service/target/jacoco.exec
[INFO] Analyzed bundle 'Service' with 7 classes
[INFO] 
[INFO] --- maven-install-plugin:2.4:install (default-install) @ dgss2526-teamA-microstories-service ---
[INFO] Installing /var/lib/jenkins/workspace/microstories-2526-teamA/service/target/dgss2526-teamA-microstories-service-0.1.0-SNAPSHOT.jar to /var/lib/jenkins/.m2/repository/es/uvigo/esei/dgss/teamA/microstories/dgss2526-teamA-microstories-service/0.1.0-SNAPSHOT/dgss2526-teamA-microstories-service-0.1.0-SNAPSHOT.jar
[INFO] Installing /var/lib/jenkins/workspace/microstories-2526-teamA/service/pom.xml to /var/lib/jenkins/.m2/repository/es/uvigo/esei/dgss/teamA/microstories/dgss2526-teamA-microstories-service/0.1.0-SNAPSHOT/dgss2526-teamA-microstories-service-0.1.0-SNAPSHOT.pom
[INFO] Installing /var/lib/jenkins/workspace/microstories-2526-teamA/service/target/dgss2526-teamA-microstories-service-0.1.0-SNAPSHOT-sources.jar to /var/lib/jenkins/.m2/repository/es/uvigo/esei/dgss/teamA/microstories/dgss2526-teamA-microstories-service/0.1.0-SNAPSHOT/dgss2526-teamA-microstories-service-0.1.0-SNAPSHOT-sources.jar
[INFO] Installing /var/lib/jenkins/workspace/microstories-2526-teamA/service/target/dgss2526-teamA-microstories-service-0.1.0-SNAPSHOT-javadoc.jar to /var/lib/jenkins/.m2/repository/es/uvigo/esei/dgss/teamA/microstories/dgss2526-teamA-microstories-service/0.1.0-SNAPSHOT/dgss2526-teamA-microstories-service-0.1.0-SNAPSHOT-javadoc.jar
[INFO] Installing /var/lib/jenkins/workspace/microstories-2526-teamA/service/target/dgss2526-teamA-microstories-service-0.1.0-SNAPSHOT-tests.jar to /var/lib/jenkins/.m2/repository/es/uvigo/esei/dgss/teamA/microstories/dgss2526-teamA-microstories-service/0.1.0-SNAPSHOT/dgss2526-teamA-microstories-service-0.1.0-SNAPSHOT-tests.jar
[INFO] 
[INFO] --< es.uvigo.esei.dgss.teamA.microstories:dgss2526-teamA-microstories-rest >--
[INFO] Building REST 0.1.0-SNAPSHOT                                       [5/7]
[INFO] --------------------------------[ war ]---------------------------------
[INFO] 
[INFO] --- maven-clean-plugin:3.3.2:clean (default-clean) @ dgss2526-teamA-microstories-rest ---
[INFO] Deleting /var/lib/jenkins/workspace/microstories-2526-teamA/rest/target
[INFO] 
[INFO] --- jacoco-maven-plugin:0.7.9:prepare-agent (pre-unit-test) @ dgss2526-teamA-microstories-rest ---
[INFO] argLine set to -javaagent:/var/lib/jenkins/.m2/repository/org/jacoco/org.jacoco.agent/0.7.9/org.jacoco.agent-0.7.9-runtime.jar=destfile=/var/lib/jenkins/workspace/microstories-2526-teamA/rest/target/jacoco.exec,classdumpdir=/var/lib/jenkins/workspace/microstories-2526-teamA/target/classes
[INFO] 
[INFO] --- maven-resources-plugin:3.0.2:resources (default-resources) @ dgss2526-teamA-microstories-rest ---
[INFO] Using 'UTF-8' encoding to copy filtered resources.
[INFO] skip non existing resourceDirectory /var/lib/jenkins/workspace/microstories-2526-teamA/rest/src/main/resources
[INFO] 
[INFO] --- maven-compiler-plugin:3.6.1:compile (default-compile) @ dgss2526-teamA-microstories-rest ---
[INFO] Changes detected - recompiling the module!
[INFO] Compiling 4 source files to /var/lib/jenkins/workspace/microstories-2526-teamA/rest/target/classes
[INFO] 
[INFO] --- maven-resources-plugin:3.0.2:testResources (default-testResources) @ dgss2526-teamA-microstories-rest ---
[INFO] Using 'UTF-8' encoding to copy filtered resources.
[INFO] Copying 5 resources
[INFO] Copying 3 resources
[INFO] 
[INFO] --- maven-compiler-plugin:3.6.1:testCompile (default-testCompile) @ dgss2526-teamA-microstories-rest ---
[INFO] Changes detected - recompiling the module!
[INFO] Compiling 3 source files to /var/lib/jenkins/workspace/microstories-2526-teamA/rest/target/test-classes
[INFO] 
[INFO] --- maven-dependency-plugin:2.10:unpack (unpack) @ dgss2526-teamA-microstories-rest ---
[INFO] Configured Artifact: org.wildfly:wildfly-dist:10.1.0.Final:zip
[INFO] Unpacking /var/lib/jenkins/.m2/repository/org/wildfly/wildfly-dist/10.1.0.Final/wildfly-dist-10.1.0.Final.zip to /var/lib/jenkins/workspace/microstories-2526-teamA/rest/target with includes "" and excludes ""
[INFO] 
[INFO] --- maven-resources-plugin:3.0.2:copy-resources (copy-wildfly-resources) @ dgss2526-teamA-microstories-rest ---
[INFO] Using 'UTF-8' encoding to copy filtered resources.
[INFO] Copying 1 resource
[INFO] 
[INFO] --- maven-surefire-plugin:2.20:test (default-test) @ dgss2526-teamA-microstories-rest ---
[INFO] 
[INFO] -------------------------------------------------------
[INFO]  T E S T S
[INFO] -------------------------------------------------------
[INFO] Running es.uvigo.esei.microstories.rest.ResourceUnitTestSuite
12:00:45,266 INFO  [org.jboss.modules] (main) JBoss Modules version 1.6.1.Final
12:00:46,030 INFO  [org.jboss.msc] (main) JBoss MSC version 1.2.7.SP1
12:00:46,596 INFO  [org.jboss.as] (MSC service thread 1-3) WFLYSRV0049: WildFly Full 10.1.0.Final (WildFly Core 2.2.0.Final) starting
12:00:52,083 INFO  [org.jboss.as.server] (Controller Boot Thread) WFLYSRV0039: Creating http management service using socket-binding (management-http)
12:00:52,190 INFO  [org.xnio] (MSC service thread 1-3) XNIO version 3.4.0.Final
12:00:52,231 INFO  [org.xnio.nio] (MSC service thread 1-3) XNIO NIO Implementation Version 3.4.0.Final
12:00:52,482 INFO  [org.jboss.remoting] (MSC service thread 1-3) JBoss Remoting version 4.0.21.Final
12:00:52,649 INFO  [org.jboss.as.clustering.infinispan] (ServerService Thread Pool -- 36) WFLYCLINF0001: Activating Infinispan subsystem.
12:00:52,700 INFO  [org.jboss.as.naming] (ServerService Thread Pool -- 44) WFLYNAM0001: Activating Naming Subsystem
12:00:52,771 WARN  [org.jboss.as.txn] (ServerService Thread Pool -- 50) WFLYTX0013: Node identifier property is set to the default value. Please make sure it is unique.
12:00:52,830 INFO  [org.jboss.as.security] (ServerService Thread Pool -- 49) WFLYSEC0002: Activating Security Subsystem
12:00:52,839 INFO  [org.jboss.as.jsf] (ServerService Thread Pool -- 42) WFLYJSF0007: Activated the following JSF Implementations: [main]
12:00:52,875 INFO  [org.jboss.as.webservices] (ServerService Thread Pool -- 52) WFLYWS0002: Activating WebServices Extension
12:00:52,968 INFO  [org.jboss.as.connector] (MSC service thread 1-4) WFLYJCA0009: Starting JCA Subsystem (WildFly/IronJacamar 1.3.4.Final)
12:00:53,022 INFO  [org.jboss.as.naming] (MSC service thread 1-4) WFLYNAM0003: Starting Naming Service
12:00:53,050 INFO  [org.wildfly.extension.io] (ServerService Thread Pool -- 35) WFLYIO001: Worker 'default' has auto-configured to 4 core threads with 32 task threads based on your 2 available processors
12:00:53,118 INFO  [org.jboss.as.security] (MSC service thread 1-4) WFLYSEC0001: Current PicketBox version=4.9.6.Final
12:00:53,205 INFO  [org.wildfly.extension.undertow] (MSC service thread 1-2) WFLYUT0003: Undertow 1.4.0.Final starting
12:00:53,219 INFO  [org.jboss.as.connector.subsystems.datasources] (ServerService Thread Pool -- 30) WFLYJCA0004: Deploying JDBC-compliant driver class org.h2.Driver (version 1.3)
12:00:53,482 INFO  [org.jboss.as.mail.extension] (MSC service thread 1-2) WFLYMAIL0001: Bound mail session [java:jboss/mail/Default]
12:00:53,489 INFO  [org.jboss.as.connector.deployers.jdbc] (MSC service thread 1-2) WFLYJCA0018: Started Driver service with driver-name = h2
12:00:54,362 INFO  [org.wildfly.extension.undertow] (ServerService Thread Pool -- 51) WFLYUT0014: Creating file handler for path '/var/lib/jenkins/workspace/microstories-2526-teamA/rest/target/wildfly-10.1.0.Final/welcome-content' with options [directory-listing: 'false', follow-symlink: 'false', case-sensitive: 'true', safe-symlink-paths: '[]']
12:00:54,403 INFO  [org.wildfly.extension.undertow] (MSC service thread 1-1) WFLYUT0012: Started server default-server.
12:00:54,418 INFO  [org.wildfly.extension.undertow] (MSC service thread 1-1) WFLYUT0018: Host default-host starting
12:00:54,829 INFO  [org.wildfly.extension.undertow] (MSC service thread 1-4) WFLYUT0006: Undertow HTTP listener default listening on 127.0.0.1:28080
12:00:55,417 INFO  [org.jboss.as.connector.subsystems.datasources] (MSC service thread 1-3) WFLYJCA0001: Bound data source [java:jboss/datasources/dgss2526/teamA/microstories]
12:00:55,417 INFO  [org.jboss.as.connector.subsystems.datasources] (MSC service thread 1-1) WFLYJCA0001: Bound data source [java:jboss/datasources/ExampleDS]
12:00:57,385 INFO  [org.infinispan.factories.GlobalComponentRegistry] (MSC service thread 1-3) ISPN000128: Infinispan version: Infinispan 'Chakra' 8.2.4.Final
12:00:57,539 INFO  [org.infinispan.configuration.cache.EvictionConfigurationBuilder] (ServerService Thread Pool -- 57) ISPN000152: Passivation configured without an eviction policy being selected. Only manually evicted entities will be passivated.
12:00:57,540 INFO  [org.infinispan.configuration.cache.EvictionConfigurationBuilder] (ServerService Thread Pool -- 57) ISPN000152: Passivation configured without an eviction policy being selected. Only manually evicted entities will be passivated.
12:00:57,546 INFO  [org.infinispan.configuration.cache.EvictionConfigurationBuilder] (ServerService Thread Pool -- 57) ISPN000152: Passivation configured without an eviction policy being selected. Only manually evicted entities will be passivated.
12:00:57,547 INFO  [org.infinispan.configuration.cache.EvictionConfigurationBuilder] (ServerService Thread Pool -- 57) ISPN000152: Passivation configured without an eviction policy being selected. Only manually evicted entities will be passivated.
12:00:57,566 INFO  [org.jboss.as.server.deployment.scanner] (MSC service thread 1-4) WFLYDS0013: Started FileSystemDeploymentService for directory /var/lib/jenkins/workspace/microstories-2526-teamA/rest/target/wildfly-10.1.0.Final/standalone/deployments
12:00:57,895 INFO  [org.jboss.ws.common.management] (MSC service thread 1-2) JBWS022052: Starting JBossWS 5.1.5.Final (Apache CXF 3.1.6) 
12:00:58,825 INFO  [org.jboss.as] (Controller Boot Thread) WFLYSRV0060: Http management interface listening on http://127.0.0.1:29990/management
12:00:58,826 INFO  [org.jboss.as] (Controller Boot Thread) WFLYSRV0051: Admin console listening on http://127.0.0.1:29990
12:00:58,826 INFO  [org.jboss.as] (Controller Boot Thread) WFLYSRV0025: WildFly Full 10.1.0.Final (WildFly Core 2.2.0.Final) started in 13206ms - Started 302 of 506 services (325 services are lazy, passive or on-demand)
12:01:01,220 WARNING [org.jboss.arquillian.core.spi.ObserverMethod] (main) Argument 2 for ArquillianServiceDeployer.doServiceDeploy is null. It won't be invoked.
12:01:06,160 INFO  [org.jboss.remoting] (main) JBoss Remoting version 5.0.2.Final
12:01:06,712 INFO  [org.xnio] (main) XNIO version 3.5.1.Final
12:01:06,746 INFO  [org.xnio.nio] (main) XNIO NIO Implementation Version 3.5.1.Final
12:01:07,091 INFO  [org.wildfly.security] (main) ELY00001: WildFly Elytron version 1.1.2.Final
12:01:17,275 WARN  [org.jboss.as.arquillian.container.ArchiveDeployer] (main) Failed to undeploy test.war: {"WFLYCTL0062: Composite operation failed and was rolled back. Steps that failed:" => {"Operation step-1" => "WFLYCTL0216: Management resource '[(\"deployment\" => \"test.war\")]' not found"}}
[ERROR] Tests run: 1, Failures: 0, Errors: 1, Skipped: 0, Time elapsed: 35.333 s <<< FAILURE! - in es.uvigo.esei.microstories.rest.ResourceUnitTestSuite
[ERROR] es.uvigo.esei.microstories.rest.StoryResourceRestTest  Time elapsed: 35.333 s  <<< ERROR!
org.jboss.arquillian.container.spi.client.container.DeploymentException: Cannot deploy: test.war
Caused by: java.net.ConnectException: WFLYPRT0023: Could not connect to remote+http://127.0.0.1:29990. The connection timed out

12:01:17,633 WARNING [org.jboss.arquillian.core.spi.ObserverMethod] (main) Argument 2 for ArquillianServiceDeployer.undeploy is null. It won't be invoked.
12:01:18,304 INFO  [org.jboss.as.connector.subsystems.datasources] (MSC service thread 1-2) WFLYJCA0010: Unbound data source [java:jboss/datasources/ExampleDS]
12:01:18,305 INFO  [org.jboss.as.connector.subsystems.datasources] (MSC service thread 1-2) WFLYJCA0010: Unbound data source [java:jboss/datasources/dgss2526/teamA/microstories]
12:01:18,321 INFO  [org.wildfly.extension.undertow] (MSC service thread 1-2) WFLYUT0019: Host default-host stopping
12:01:18,365 INFO  [org.jboss.as.connector.deployers.jdbc] (MSC service thread 1-3) WFLYJCA0019: Stopped Driver service with driver-name = h2
12:01:18,446 INFO  [org.wildfly.extension.undertow] (MSC service thread 1-2) WFLYUT0008: Undertow HTTP listener default suspending
12:01:18,450 INFO  [org.wildfly.extension.undertow] (MSC service thread 1-2) WFLYUT0007: Undertow HTTP listener default stopped, was bound to 127.0.0.1:28080
12:01:18,454 INFO  [org.wildfly.extension.undertow] (MSC service thread 1-2) WFLYUT0004: Undertow 1.4.0.Final stopping
12:01:18,744 INFO  [org.jboss.as] (MSC service thread 1-3) WFLYSRV0050: WildFly Full 10.1.0.Final (WildFly Core 2.2.0.Final) stopped in 898ms
[INFO] 
[INFO] Results:
[INFO] 
[ERROR] Errors: 
[ERROR]   StoryResourceRestTest.es.uvigo.esei.microstories.rest.StoryResourceRestTest » Deployment
[INFO] 
[ERROR] Tests run: 1, Failures: 0, Errors: 1, Skipped: 0
[INFO] 
[ERROR] There are test failures.

Please refer to /var/lib/jenkins/workspace/microstories-2526-teamA/rest/target/surefire-reports for the individual test results.
Please refer to dump files (if any exist) [date]-jvmRun[N].dump, [date].dumpstream and [date]-jvmRun[N].dumpstream.
[JENKINS] Recording test results
[INFO] 
[INFO] --- jacoco-maven-plugin:0.7.9:report (post-unit-test) @ dgss2526-teamA-microstories-rest ---
[INFO] Loading execution data file /var/lib/jenkins/workspace/microstories-2526-teamA/rest/target/jacoco.exec
[INFO] Analyzed bundle 'REST' with 3 classes
[INFO] 
[INFO] --- maven-war-plugin:3.3.2:war (default-war) @ dgss2526-teamA-microstories-rest ---
[INFO] Packaging webapp
[INFO] Assembling webapp [dgss2526-teamA-microstories-rest] in [/var/lib/jenkins/workspace/microstories-2526-teamA/rest/target/dgss2526-teamA-microstories-rest-0.1.0-SNAPSHOT]
[INFO] Processing war project
[INFO] Copying webapp resources [/var/lib/jenkins/workspace/microstories-2526-teamA/rest/src/main/webapp]
[INFO] Building war: /var/lib/jenkins/workspace/microstories-2526-teamA/rest/target/dgss2526-teamA-microstories-rest-0.1.0-SNAPSHOT.war
[INFO] 
[INFO] >>> maven-source-plugin:3.0.1:jar (attach-sources) > generate-sources @ dgss2526-teamA-microstories-rest >>>
[INFO] 
[INFO] --- jacoco-maven-plugin:0.7.9:prepare-agent (pre-unit-test) @ dgss2526-teamA-microstories-rest ---
[INFO] argLine set to -javaagent:/var/lib/jenkins/.m2/repository/org/jacoco/org.jacoco.agent/0.7.9/org.jacoco.agent-0.7.9-runtime.jar=destfile=/var/lib/jenkins/workspace/microstories-2526-teamA/rest/target/jacoco.exec,classdumpdir=/var/lib/jenkins/workspace/microstories-2526-teamA/target/classes
[WARNING] Failed to getClass for org.apache.maven.plugins.source.SourceJarMojo
[INFO] 
[INFO] <<< maven-source-plugin:3.0.1:jar (attach-sources) < generate-sources @ dgss2526-teamA-microstories-rest <<<
[INFO] 
[INFO] 
[INFO] --- maven-source-plugin:3.0.1:jar (attach-sources) @ dgss2526-teamA-microstories-rest ---
[INFO] Building jar: /var/lib/jenkins/workspace/microstories-2526-teamA/rest/target/dgss2526-teamA-microstories-rest-0.1.0-SNAPSHOT-sources.jar
[INFO] 
[INFO] --- maven-javadoc-plugin:2.10.4:jar (attach-javadocs) @ dgss2526-teamA-microstories-rest ---
[INFO] 
Loading source files for package es.uvigo.esei.microstories.annotations...
Loading source files for package es.uvigo.esei.microstories.rest...
Loading source files for package es.uvigo.esei.microstories.converters...
Loading source files for package es.uvigo.esei.microstories.providers...
Constructing Javadoc information...
Standard Doclet version 1.8.0_144
Building tree for all the packages and classes...
Generating /var/lib/jenkins/workspace/microstories-2526-teamA/rest/target/apidocs/es/uvigo/esei/microstories/annotations/DateFormat.html...
Generating /var/lib/jenkins/workspace/microstories-2526-teamA/rest/target/apidocs/es/uvigo/esei/microstories/rest/StoryResource.html...
Generating /var/lib/jenkins/workspace/microstories-2526-teamA/rest/target/apidocs/es/uvigo/esei/microstories/converters/DateParamConverter.html...
Generating /var/lib/jenkins/workspace/microstories-2526-teamA/rest/target/apidocs/es/uvigo/esei/microstories/providers/DateParamConverterProvider.html...
Generating /var/lib/jenkins/workspace/microstories-2526-teamA/rest/target/apidocs/overview-frame.html...
Generating /var/lib/jenkins/workspace/microstories-2526-teamA/rest/target/apidocs/es/uvigo/esei/microstories/annotations/package-frame.html...
Generating /var/lib/jenkins/workspace/microstories-2526-teamA/rest/target/apidocs/es/uvigo/esei/microstories/annotations/package-summary.html...
Generating /var/lib/jenkins/workspace/microstories-2526-teamA/rest/target/apidocs/es/uvigo/esei/microstories/annotations/package-tree.html...
Generating /var/lib/jenkins/workspace/microstories-2526-teamA/rest/target/apidocs/es/uvigo/esei/microstories/converters/package-frame.html...
Generating /var/lib/jenkins/workspace/microstories-2526-teamA/rest/target/apidocs/es/uvigo/esei/microstories/converters/package-summary.html...
Generating /var/lib/jenkins/workspace/microstories-2526-teamA/rest/target/apidocs/es/uvigo/esei/microstories/converters/package-tree.html...
Generating /var/lib/jenkins/workspace/microstories-2526-teamA/rest/target/apidocs/es/uvigo/esei/microstories/providers/package-frame.html...
Generating /var/lib/jenkins/workspace/microstories-2526-teamA/rest/target/apidocs/es/uvigo/esei/microstories/providers/package-summary.html...
Generating /var/lib/jenkins/workspace/microstories-2526-teamA/rest/target/apidocs/es/uvigo/esei/microstories/providers/package-tree.html...
Generating /var/lib/jenkins/workspace/microstories-2526-teamA/rest/target/apidocs/es/uvigo/esei/microstories/rest/package-frame.html...
Generating /var/lib/jenkins/workspace/microstories-2526-teamA/rest/target/apidocs/es/uvigo/esei/microstories/rest/package-summary.html...
Generating /var/lib/jenkins/workspace/microstories-2526-teamA/rest/target/apidocs/es/uvigo/esei/microstories/rest/package-tree.html...
Generating /var/lib/jenkins/workspace/microstories-2526-teamA/rest/target/apidocs/constant-values.html...
Generating /var/lib/jenkins/workspace/microstories-2526-teamA/rest/target/apidocs/es/uvigo/esei/microstories/annotations/class-use/DateFormat.html...
Generating /var/lib/jenkins/workspace/microstories-2526-teamA/rest/target/apidocs/es/uvigo/esei/microstories/rest/class-use/StoryResource.html...
Generating /var/lib/jenkins/workspace/microstories-2526-teamA/rest/target/apidocs/es/uvigo/esei/microstories/converters/class-use/DateParamConverter.html...
Generating /var/lib/jenkins/workspace/microstories-2526-teamA/rest/target/apidocs/es/uvigo/esei/microstories/providers/class-use/DateParamConverterProvider.html...
Generating /var/lib/jenkins/workspace/microstories-2526-teamA/rest/target/apidocs/es/uvigo/esei/microstories/annotations/package-use.html...
Generating /var/lib/jenkins/workspace/microstories-2526-teamA/rest/target/apidocs/es/uvigo/esei/microstories/converters/package-use.html...
Generating /var/lib/jenkins/workspace/microstories-2526-teamA/rest/target/apidocs/es/uvigo/esei/microstories/providers/package-use.html...
Generating /var/lib/jenkins/workspace/microstories-2526-teamA/rest/target/apidocs/es/uvigo/esei/microstories/rest/package-use.html...
Building index for all the packages and classes...
Generating /var/lib/jenkins/workspace/microstories-2526-teamA/rest/target/apidocs/overview-tree.html...
Generating /var/lib/jenkins/workspace/microstories-2526-teamA/rest/target/apidocs/index-all.html...
Generating /var/lib/jenkins/workspace/microstories-2526-teamA/rest/target/apidocs/deprecated-list.html...
Building index for all classes...
Generating /var/lib/jenkins/workspace/microstories-2526-teamA/rest/target/apidocs/allclasses-frame.html...
Generating /var/lib/jenkins/workspace/microstories-2526-teamA/rest/target/apidocs/allclasses-noframe.html...
Generating /var/lib/jenkins/workspace/microstories-2526-teamA/rest/target/apidocs/index.html...
Generating /var/lib/jenkins/workspace/microstories-2526-teamA/rest/target/apidocs/overview-summary.html...
Generating /var/lib/jenkins/workspace/microstories-2526-teamA/rest/target/apidocs/help-doc.html...
[INFO] Building jar: /var/lib/jenkins/workspace/microstories-2526-teamA/rest/target/dgss2526-teamA-microstories-rest-0.1.0-SNAPSHOT-javadoc.jar
[INFO] 
[INFO] --- jacoco-maven-plugin:0.7.9:prepare-agent (pre-integration-test) @ dgss2526-teamA-microstories-rest ---
[INFO] argLine set to -javaagent:/var/lib/jenkins/.m2/repository/org/jacoco/org.jacoco.agent/0.7.9/org.jacoco.agent-0.7.9-runtime.jar=destfile=/var/lib/jenkins/workspace/microstories-2526-teamA/rest/target/jacoco.exec,classdumpdir=/var/lib/jenkins/workspace/microstories-2526-teamA/target/classes
[INFO] 
[INFO] --- jacoco-maven-plugin:0.7.9:report (post-integration-test) @ dgss2526-teamA-microstories-rest ---
[INFO] Loading execution data file /var/lib/jenkins/workspace/microstories-2526-teamA/rest/target/jacoco.exec
[INFO] Analyzed bundle 'REST' with 3 classes
[INFO] 
[INFO] --- maven-install-plugin:2.4:install (default-install) @ dgss2526-teamA-microstories-rest ---
[INFO] Installing /var/lib/jenkins/workspace/microstories-2526-teamA/rest/target/dgss2526-teamA-microstories-rest-0.1.0-SNAPSHOT.war to /var/lib/jenkins/.m2/repository/es/uvigo/esei/dgss/teamA/microstories/dgss2526-teamA-microstories-rest/0.1.0-SNAPSHOT/dgss2526-teamA-microstories-rest-0.1.0-SNAPSHOT.war
[INFO] Installing /var/lib/jenkins/workspace/microstories-2526-teamA/rest/pom.xml to /var/lib/jenkins/.m2/repository/es/uvigo/esei/dgss/teamA/microstories/dgss2526-teamA-microstories-rest/0.1.0-SNAPSHOT/dgss2526-teamA-microstories-rest-0.1.0-SNAPSHOT.pom
[INFO] Installing /var/lib/jenkins/workspace/microstories-2526-teamA/rest/target/dgss2526-teamA-microstories-rest-0.1.0-SNAPSHOT-sources.jar to /var/lib/jenkins/.m2/repository/es/uvigo/esei/dgss/teamA/microstories/dgss2526-teamA-microstories-rest/0.1.0-SNAPSHOT/dgss2526-teamA-microstories-rest-0.1.0-SNAPSHOT-sources.jar
[INFO] Installing /var/lib/jenkins/workspace/microstories-2526-teamA/rest/target/dgss2526-teamA-microstories-rest-0.1.0-SNAPSHOT-javadoc.jar to /var/lib/jenkins/.m2/repository/es/uvigo/esei/dgss/teamA/microstories/dgss2526-teamA-microstories-rest/0.1.0-SNAPSHOT/dgss2526-teamA-microstories-rest-0.1.0-SNAPSHOT-javadoc.jar
[INFO] 
[INFO] --< es.uvigo.esei.dgss.teamA.microstories:dgss2526-teamA-microstories-jsf >--
[INFO] Building JSF 0.1.0-SNAPSHOT                                        [6/7]
[INFO] --------------------------------[ war ]---------------------------------
[INFO] 
[INFO] --- maven-clean-plugin:3.3.2:clean (default-clean) @ dgss2526-teamA-microstories-jsf ---
[INFO] Deleting /var/lib/jenkins/workspace/microstories-2526-teamA/jsf/target
[INFO] 
[INFO] --- jacoco-maven-plugin:0.7.9:prepare-agent (pre-unit-test) @ dgss2526-teamA-microstories-jsf ---
[INFO] argLine set to -javaagent:/var/lib/jenkins/.m2/repository/org/jacoco/org.jacoco.agent/0.7.9/org.jacoco.agent-0.7.9-runtime.jar=destfile=/var/lib/jenkins/workspace/microstories-2526-teamA/jsf/target/jacoco.exec,classdumpdir=/var/lib/jenkins/workspace/microstories-2526-teamA/target/classes
[INFO] 
[INFO] --- maven-resources-plugin:3.0.2:resources (default-resources) @ dgss2526-teamA-microstories-jsf ---
[INFO] Using 'UTF-8' encoding to copy filtered resources.
[INFO] skip non existing resourceDirectory /var/lib/jenkins/workspace/microstories-2526-teamA/jsf/src/main/resources
[INFO] 
[INFO] --- maven-compiler-plugin:3.6.1:compile (default-compile) @ dgss2526-teamA-microstories-jsf ---
[INFO] Changes detected - recompiling the module!
[INFO] Compiling 11 source files to /var/lib/jenkins/workspace/microstories-2526-teamA/jsf/target/classes
[INFO] 
[INFO] --- maven-resources-plugin:3.0.2:testResources (default-testResources) @ dgss2526-teamA-microstories-jsf ---
[INFO] Using 'UTF-8' encoding to copy filtered resources.
[INFO] Copying 5 resources
[INFO] Copying 3 resources
[INFO] 
[INFO] --- maven-antrun-plugin:1.8:run (download-geckodriver) @ dgss2526-teamA-microstories-jsf ---
[INFO] Executing tasks

main:
    [mkdir] Created dir: /var/lib/jenkins/workspace/microstories-2526-teamA/jsf/target/geckodriver
      [get] Getting: https://github.com/mozilla/geckodriver/releases/download/v0.19.1/geckodriver-v0.19.1-linux64.tar.gz
      [get] To: /var/lib/jenkins/workspace/microstories-2526-teamA/jsf/target/geckodriver/geckodriver-v0.19.1-linux64.tar.gz
      [get] https://github.com/mozilla/geckodriver/releases/download/v0.19.1/geckodriver-v0.19.1-linux64.tar.gz moved to https://release-assets.githubusercontent.com/github-production-release-asset/25354393/e31e4c22-be6f-11e7-9bc7-dedc3490a7fd?sp=r&sv=2018-11-09&sr=b&spr=https&se=2026-06-28T10%3A36%3A43Z&rscd=attachment%3B+filename%3Dgeckodriver-v0.19.1-linux64.tar.gz&rsct=application%2Foctet-stream&skoid=96c2d410-5711-43a1-aedd-ab1947aa7ab0&sktid=398a6654-997b-47e9-b12b-9515b896b4de&skt=2026-06-28T09%3A36%3A15Z&ske=2026-06-28T10%3A36%3A43Z&sks=b&skv=2018-11-09&sig=xa0cohAl6SlvPxHfZKApNNeB%2FdSK9V5Q0ki6v9HmtM8%3D&jwt=eyJ0eXAiOiJKV1QiLCJhbGciOiJIUzI1NiJ9.eyJpc3MiOiJnaXRodWIuY29tIiwiYXVkIjoicmVsZWFzZS1hc3NldHMuZ2l0aHVidXNlcmNvbnRlbnQuY29tIiwia2V5Ijoia2V5MSIsImV4cCI6MTc4MjY0MDkwNiwibmJmIjoxNzgyNjQwNjA2LCJwYXRoIjoicmVsZWFzZWFzc2V0cHJvZHVjdGlvbi5ibG9iLmNvcmUud2luZG93cy5uZXQifQ.GiD8LiA9BomegPCcbpjqigUpajCYB7MByEX-iPT3K7I&response-content-disposition=attachment%3B%20filename%3Dgeckodriver-v0.19.1-linux64.tar.gz&response-content-type=application%2Foctet-stream
    [untar] Expanding: /var/lib/jenkins/workspace/microstories-2526-teamA/jsf/target/geckodriver/geckodriver-v0.19.1-linux64.tar.gz into /var/lib/jenkins/workspace/microstories-2526-teamA/jsf/target/geckodriver
[INFO] Executed tasks
[INFO] 
[INFO] --- maven-compiler-plugin:3.6.1:testCompile (default-testCompile) @ dgss2526-teamA-microstories-jsf ---
[INFO] Changes detected - recompiling the module!
[INFO] Compiling 1 source file to /var/lib/jenkins/workspace/microstories-2526-teamA/jsf/target/test-classes
[INFO] 
[INFO] --- maven-dependency-plugin:2.10:unpack (unpack) @ dgss2526-teamA-microstories-jsf ---
[INFO] Configured Artifact: org.wildfly:wildfly-dist:10.1.0.Final:zip
[INFO] Unpacking /var/lib/jenkins/.m2/repository/org/wildfly/wildfly-dist/10.1.0.Final/wildfly-dist-10.1.0.Final.zip to /var/lib/jenkins/workspace/microstories-2526-teamA/jsf/target with includes "" and excludes ""
[INFO] 
[INFO] --- maven-resources-plugin:3.0.2:copy-resources (copy-wildfly-resources) @ dgss2526-teamA-microstories-jsf ---
[INFO] Using 'UTF-8' encoding to copy filtered resources.
[INFO] Copying 1 resource
[INFO] 
[INFO] --- maven-surefire-plugin:2.20:test (default-test) @ dgss2526-teamA-microstories-jsf ---
[INFO] Tests are skipped.
[INFO] 
[INFO] --- jacoco-maven-plugin:0.7.9:report (post-unit-test) @ dgss2526-teamA-microstories-jsf ---
[INFO] Skipping JaCoCo execution due to missing execution data file.
[INFO] 
[INFO] --- maven-war-plugin:3.3.2:war (default-war) @ dgss2526-teamA-microstories-jsf ---
[INFO] Packaging webapp
[INFO] Assembling webapp [dgss2526-teamA-microstories-jsf] in [/var/lib/jenkins/workspace/microstories-2526-teamA/jsf/target/dgss2526-teamA-microstories-jsf-0.1.0-SNAPSHOT]
[INFO] Processing war project
[INFO] Copying webapp resources [/var/lib/jenkins/workspace/microstories-2526-teamA/jsf/src/main/webapp]
[INFO] Building war: /var/lib/jenkins/workspace/microstories-2526-teamA/jsf/target/dgss2526-teamA-microstories-jsf-0.1.0-SNAPSHOT.war
[INFO] 
[INFO] >>> maven-source-plugin:3.0.1:jar (attach-sources) > generate-sources @ dgss2526-teamA-microstories-jsf >>>
[INFO] 
[INFO] --- jacoco-maven-plugin:0.7.9:prepare-agent (pre-unit-test) @ dgss2526-teamA-microstories-jsf ---
[INFO] argLine set to -javaagent:/var/lib/jenkins/.m2/repository/org/jacoco/org.jacoco.agent/0.7.9/org.jacoco.agent-0.7.9-runtime.jar=destfile=/var/lib/jenkins/workspace/microstories-2526-teamA/jsf/target/jacoco.exec,classdumpdir=/var/lib/jenkins/workspace/microstories-2526-teamA/target/classes
[WARNING] Failed to getClass for org.apache.maven.plugins.source.SourceJarMojo
[INFO] 
[INFO] <<< maven-source-plugin:3.0.1:jar (attach-sources) < generate-sources @ dgss2526-teamA-microstories-jsf <<<
[INFO] 
[INFO] 
[INFO] --- maven-source-plugin:3.0.1:jar (attach-sources) @ dgss2526-teamA-microstories-jsf ---
[INFO] Building jar: /var/lib/jenkins/workspace/microstories-2526-teamA/jsf/target/dgss2526-teamA-microstories-jsf-0.1.0-SNAPSHOT-sources.jar
[INFO] 
[INFO] --- maven-javadoc-plugin:2.10.4:jar (attach-javadocs) @ dgss2526-teamA-microstories-jsf ---
[INFO] 
Loading source files for package es.uvigo.esei.microstories.jsf.pagination...
Loading source files for package es.uvigo.esei.microstories.jsf...
Constructing Javadoc information...
Standard Doclet version 1.8.0_144
Building tree for all the packages and classes...
Generating /var/lib/jenkins/workspace/microstories-2526-teamA/jsf/target/apidocs/es/uvigo/esei/microstories/jsf/pagination/NavigationStoryListHistory.html...
Generating /var/lib/jenkins/workspace/microstories-2526-teamA/jsf/target/apidocs/es/uvigo/esei/microstories/jsf/pagination/Paginated.html...
Generating /var/lib/jenkins/workspace/microstories-2526-teamA/jsf/target/apidocs/es/uvigo/esei/microstories/jsf/ExploreBean.html...
Generating /var/lib/jenkins/workspace/microstories-2526-teamA/jsf/target/apidocs/es/uvigo/esei/microstories/jsf/ExploreBean.ExploreParams.html...
Generating /var/lib/jenkins/workspace/microstories-2526-teamA/jsf/target/apidocs/es/uvigo/esei/microstories/jsf/GenreTypeConverter.html...
Generating /var/lib/jenkins/workspace/microstories-2526-teamA/jsf/target/apidocs/es/uvigo/esei/microstories/jsf/LikedStoriesBean.html...
Generating /var/lib/jenkins/workspace/microstories-2526-teamA/jsf/target/apidocs/es/uvigo/esei/microstories/jsf/LoginBean.html...
Generating /var/lib/jenkins/workspace/microstories-2526-teamA/jsf/target/apidocs/es/uvigo/esei/microstories/jsf/NavigationContext.html...
Generating /var/lib/jenkins/workspace/microstories-2526-teamA/jsf/target/apidocs/es/uvigo/esei/microstories/jsf/ProfileBean.html...
Generating /var/lib/jenkins/workspace/microstories-2526-teamA/jsf/target/apidocs/es/uvigo/esei/microstories/jsf/StoryEditorBean.html...
Generating /var/lib/jenkins/workspace/microstories-2526-teamA/jsf/target/apidocs/es/uvigo/esei/microstories/jsf/StoryManagedBean.html...
Generating /var/lib/jenkins/workspace/microstories-2526-teamA/jsf/target/apidocs/es/uvigo/esei/microstories/jsf/ThemeTypeConverter.html...
Generating /var/lib/jenkins/workspace/microstories-2526-teamA/jsf/target/apidocs/overview-frame.html...
Generating /var/lib/jenkins/workspace/microstories-2526-teamA/jsf/target/apidocs/es/uvigo/esei/microstories/jsf/package-frame.html...
Generating /var/lib/jenkins/workspace/microstories-2526-teamA/jsf/target/apidocs/es/uvigo/esei/microstories/jsf/package-summary.html...
Generating /var/lib/jenkins/workspace/microstories-2526-teamA/jsf/target/apidocs/es/uvigo/esei/microstories/jsf/package-tree.html...
Generating /var/lib/jenkins/workspace/microstories-2526-teamA/jsf/target/apidocs/es/uvigo/esei/microstories/jsf/pagination/package-frame.html...
Generating /var/lib/jenkins/workspace/microstories-2526-teamA/jsf/target/apidocs/es/uvigo/esei/microstories/jsf/pagination/package-summary.html...
Generating /var/lib/jenkins/workspace/microstories-2526-teamA/jsf/target/apidocs/es/uvigo/esei/microstories/jsf/pagination/package-tree.html...
Generating /var/lib/jenkins/workspace/microstories-2526-teamA/jsf/target/apidocs/constant-values.html...
Generating /var/lib/jenkins/workspace/microstories-2526-teamA/jsf/target/apidocs/serialized-form.html...
Generating /var/lib/jenkins/workspace/microstories-2526-teamA/jsf/target/apidocs/es/uvigo/esei/microstories/jsf/pagination/class-use/NavigationStoryListHistory.html...
Generating /var/lib/jenkins/workspace/microstories-2526-teamA/jsf/target/apidocs/es/uvigo/esei/microstories/jsf/pagination/class-use/Paginated.html...
Generating /var/lib/jenkins/workspace/microstories-2526-teamA/jsf/target/apidocs/es/uvigo/esei/microstories/jsf/class-use/ProfileBean.html...
Generating /var/lib/jenkins/workspace/microstories-2526-teamA/jsf/target/apidocs/es/uvigo/esei/microstories/jsf/class-use/ExploreBean.html...
Generating /var/lib/jenkins/workspace/microstories-2526-teamA/jsf/target/apidocs/es/uvigo/esei/microstories/jsf/class-use/ExploreBean.ExploreParams.html...
Generating /var/lib/jenkins/workspace/microstories-2526-teamA/jsf/target/apidocs/es/uvigo/esei/microstories/jsf/class-use/LoginBean.html...
Generating /var/lib/jenkins/workspace/microstories-2526-teamA/jsf/target/apidocs/es/uvigo/esei/microstories/jsf/class-use/ThemeTypeConverter.html...
Generating /var/lib/jenkins/workspace/microstories-2526-teamA/jsf/target/apidocs/es/uvigo/esei/microstories/jsf/class-use/StoryManagedBean.html...
Generating /var/lib/jenkins/workspace/microstories-2526-teamA/jsf/target/apidocs/es/uvigo/esei/microstories/jsf/class-use/LikedStoriesBean.html...
Generating /var/lib/jenkins/workspace/microstories-2526-teamA/jsf/target/apidocs/es/uvigo/esei/microstories/jsf/class-use/NavigationContext.html...
Generating /var/lib/jenkins/workspace/microstories-2526-teamA/jsf/target/apidocs/es/uvigo/esei/microstories/jsf/class-use/StoryEditorBean.html...
Generating /var/lib/jenkins/workspace/microstories-2526-teamA/jsf/target/apidocs/es/uvigo/esei/microstories/jsf/class-use/GenreTypeConverter.html...
Generating /var/lib/jenkins/workspace/microstories-2526-teamA/jsf/target/apidocs/es/uvigo/esei/microstories/jsf/package-use.html...
Generating /var/lib/jenkins/workspace/microstories-2526-teamA/jsf/target/apidocs/es/uvigo/esei/microstories/jsf/pagination/package-use.html...
Building index for all the packages and classes...
Generating /var/lib/jenkins/workspace/microstories-2526-teamA/jsf/target/apidocs/overview-tree.html...
Generating /var/lib/jenkins/workspace/microstories-2526-teamA/jsf/target/apidocs/index-all.html...
Generating /var/lib/jenkins/workspace/microstories-2526-teamA/jsf/target/apidocs/deprecated-list.html...
Building index for all classes...
Generating /var/lib/jenkins/workspace/microstories-2526-teamA/jsf/target/apidocs/allclasses-frame.html...
Generating /var/lib/jenkins/workspace/microstories-2526-teamA/jsf/target/apidocs/allclasses-noframe.html...
Generating /var/lib/jenkins/workspace/microstories-2526-teamA/jsf/target/apidocs/index.html...
Generating /var/lib/jenkins/workspace/microstories-2526-teamA/jsf/target/apidocs/overview-summary.html...
Generating /var/lib/jenkins/workspace/microstories-2526-teamA/jsf/target/apidocs/help-doc.html...
4 warnings
[WARNING] Javadoc Warnings
[WARNING] /var/lib/jenkins/workspace/microstories-2526-teamA/jsf/src/main/java/es/uvigo/esei/microstories/jsf/StoryEditorBean.java:187: warning: no @return
[WARNING] public int getMaxContentLength() {
[WARNING] ^
[WARNING] /var/lib/jenkins/workspace/microstories-2526-teamA/jsf/src/main/java/es/uvigo/esei/microstories/jsf/StoryEditorBean.java:201: warning: no @return
[WARNING] public List<GenreType> getAvailableGenres() {
[WARNING] ^
[WARNING] /var/lib/jenkins/workspace/microstories-2526-teamA/jsf/src/main/java/es/uvigo/esei/microstories/jsf/StoryEditorBean.java:208: warning: no @return
[WARNING] public List<ThemeType> getAvailableThemes() {
[WARNING] ^
[WARNING] /var/lib/jenkins/workspace/microstories-2526-teamA/jsf/src/main/java/es/uvigo/esei/microstories/jsf/StoryEditorBean.java:215: warning: no @return
[WARNING] public boolean isReadOnly() {
[WARNING] ^
[INFO] Building jar: /var/lib/jenkins/workspace/microstories-2526-teamA/jsf/target/dgss2526-teamA-microstories-jsf-0.1.0-SNAPSHOT-javadoc.jar
[INFO] 
[INFO] --- jacoco-maven-plugin:0.7.9:prepare-agent (pre-integration-test) @ dgss2526-teamA-microstories-jsf ---
[INFO] argLine set to -javaagent:/var/lib/jenkins/.m2/repository/org/jacoco/org.jacoco.agent/0.7.9/org.jacoco.agent-0.7.9-runtime.jar=destfile=/var/lib/jenkins/workspace/microstories-2526-teamA/jsf/target/jacoco.exec,classdumpdir=/var/lib/jenkins/workspace/microstories-2526-teamA/target/classes
[INFO] 
[INFO] --- jacoco-maven-plugin:0.7.9:report (post-integration-test) @ dgss2526-teamA-microstories-jsf ---
[INFO] Skipping JaCoCo execution due to missing execution data file.
[INFO] 
[INFO] --- maven-install-plugin:2.4:install (default-install) @ dgss2526-teamA-microstories-jsf ---
[INFO] Installing /var/lib/jenkins/workspace/microstories-2526-teamA/jsf/target/dgss2526-teamA-microstories-jsf-0.1.0-SNAPSHOT.war to /var/lib/jenkins/.m2/repository/es/uvigo/esei/dgss/teamA/microstories/dgss2526-teamA-microstories-jsf/0.1.0-SNAPSHOT/dgss2526-teamA-microstories-jsf-0.1.0-SNAPSHOT.war
[INFO] Installing /var/lib/jenkins/workspace/microstories-2526-teamA/jsf/pom.xml to /var/lib/jenkins/.m2/repository/es/uvigo/esei/dgss/teamA/microstories/dgss2526-teamA-microstories-jsf/0.1.0-SNAPSHOT/dgss2526-teamA-microstories-jsf-0.1.0-SNAPSHOT.pom
[INFO] Installing /var/lib/jenkins/workspace/microstories-2526-teamA/jsf/target/dgss2526-teamA-microstories-jsf-0.1.0-SNAPSHOT-sources.jar to /var/lib/jenkins/.m2/repository/es/uvigo/esei/dgss/teamA/microstories/dgss2526-teamA-microstories-jsf/0.1.0-SNAPSHOT/dgss2526-teamA-microstories-jsf-0.1.0-SNAPSHOT-sources.jar
[INFO] Installing /var/lib/jenkins/workspace/microstories-2526-teamA/jsf/target/dgss2526-teamA-microstories-jsf-0.1.0-SNAPSHOT-javadoc.jar to /var/lib/jenkins/.m2/repository/es/uvigo/esei/dgss/teamA/microstories/dgss2526-teamA-microstories-jsf/0.1.0-SNAPSHOT/dgss2526-teamA-microstories-jsf-0.1.0-SNAPSHOT-javadoc.jar
[INFO] 
[INFO] --< es.uvigo.esei.dgss.teamA.microstories:dgss2526-teamA-microstories-ear >--
[INFO] Building EAR 0.1.0-SNAPSHOT                                        [7/7]
[INFO] --------------------------------[ ear ]---------------------------------
[INFO] 
[INFO] --- maven-clean-plugin:3.3.2:clean (default-clean) @ dgss2526-teamA-microstories-ear ---
[INFO] Deleting /var/lib/jenkins/workspace/microstories-2526-teamA/ear/target
[INFO] 
[INFO] --- maven-ear-plugin:2.10.1:generate-application-xml (default-generate-application-xml) @ dgss2526-teamA-microstories-ear ---
[INFO] Generating application.xml
[INFO] 
[INFO] --- maven-resources-plugin:3.0.2:resources (default-resources) @ dgss2526-teamA-microstories-ear ---
[INFO] Using 'UTF-8' encoding to copy filtered resources.
[INFO] skip non existing resourceDirectory /var/lib/jenkins/workspace/microstories-2526-teamA/ear/src/main/resources
[INFO] 
[INFO] --- maven-dependency-plugin:2.10:unpack (unpack) @ dgss2526-teamA-microstories-ear ---
[INFO] Skipping plugin execution
[INFO] 
[INFO] --- maven-resources-plugin:3.0.2:copy-resources (copy-wildfly-resources) @ dgss2526-teamA-microstories-ear ---
[INFO] Using 'UTF-8' encoding to copy filtered resources.
[INFO] skip non existing resourceDirectory /var/lib/jenkins/workspace/microstories-2526-teamA/ear/src/test/resources-wildfly-embedded-h2
[INFO] 
[INFO] --- maven-ear-plugin:2.10.1:ear (default-ear) @ dgss2526-teamA-microstories-ear ---
[INFO] Copying artifact [war:es.uvigo.esei.dgss.teamA.microstories:dgss2526-teamA-microstories-jsf:0.1.0-SNAPSHOT] to [dgss2526-teamA-microstories-jsf-0.1.0-SNAPSHOT.war]
[INFO] Building zip: /var/lib/jenkins/workspace/microstories-2526-teamA/ear/target/dgss2526-teamA-microstories-ear-0.1.0-SNAPSHOT/dgss2526-teamA-microstories-jsf-0.1.0-SNAPSHOT.war
[INFO] Copying artifact [war:es.uvigo.esei.dgss.teamA.microstories:dgss2526-teamA-microstories-rest:0.1.0-SNAPSHOT] to [dgss2526-teamA-microstories-rest-0.1.0-SNAPSHOT.war]
[INFO] Building zip: /var/lib/jenkins/workspace/microstories-2526-teamA/ear/target/dgss2526-teamA-microstories-ear-0.1.0-SNAPSHOT/dgss2526-teamA-microstories-rest-0.1.0-SNAPSHOT.war
[INFO] Copying artifact [jar:es.uvigo.esei.dgss.teamA.microstories:dgss2526-teamA-microstories-domain:0.1.0-SNAPSHOT] to [lib/dgss2526-teamA-microstories-domain-0.1.0-SNAPSHOT.jar]
[INFO] Copying artifact [jar:org.apache.commons:commons-lang3:3.4] to [lib/commons-lang3-3.4.jar]
[INFO] Copying artifact [ejb:es.uvigo.esei.dgss.teamA.microstories:dgss2526-teamA-microstories-service:0.1.0-SNAPSHOT] to [dgss2526-teamA-microstories-service-0.1.0-SNAPSHOT.jar]
[INFO] Building zip: /var/lib/jenkins/workspace/microstories-2526-teamA/ear/target/dgss2526-teamA-microstories-ear-0.1.0-SNAPSHOT/dgss2526-teamA-microstories-service-0.1.0-SNAPSHOT.jar
[INFO] Could not find manifest file: /var/lib/jenkins/workspace/microstories-2526-teamA/ear/target/dgss2526-teamA-microstories-ear-0.1.0-SNAPSHOT/META-INF/MANIFEST.MF - Generating one
[INFO] Building jar: /var/lib/jenkins/workspace/microstories-2526-teamA/ear/target/dgss2526-teamA-microstories-pom-0.1.0-SNAPSHOT.ear
[INFO] 
[INFO] >>> maven-source-plugin:3.0.1:jar (attach-sources) > generate-sources @ dgss2526-teamA-microstories-ear >>>
[WARNING] Failed to getClass for org.apache.maven.plugins.source.SourceJarMojo
[INFO] 
[INFO] <<< maven-source-plugin:3.0.1:jar (attach-sources) < generate-sources @ dgss2526-teamA-microstories-ear <<<
[INFO] 
[INFO] 
[INFO] --- maven-source-plugin:3.0.1:jar (attach-sources) @ dgss2526-teamA-microstories-ear ---
[INFO] No sources in project. Archive not created.
[INFO] 
[INFO] --- maven-javadoc-plugin:2.10.4:jar (attach-javadocs) @ dgss2526-teamA-microstories-ear ---
[INFO] 
[INFO] --- maven-install-plugin:2.4:install (default-install) @ dgss2526-teamA-microstories-ear ---
[INFO] Installing /var/lib/jenkins/workspace/microstories-2526-teamA/ear/target/dgss2526-teamA-microstories-pom-0.1.0-SNAPSHOT.ear to /var/lib/jenkins/.m2/repository/es/uvigo/esei/dgss/teamA/microstories/dgss2526-teamA-microstories-ear/0.1.0-SNAPSHOT/dgss2526-teamA-microstories-ear-0.1.0-SNAPSHOT.ear
[INFO] Installing /var/lib/jenkins/workspace/microstories-2526-teamA/ear/pom.xml to /var/lib/jenkins/.m2/repository/es/uvigo/esei/dgss/teamA/microstories/dgss2526-teamA-microstories-ear/0.1.0-SNAPSHOT/dgss2526-teamA-microstories-ear-0.1.0-SNAPSHOT.pom
[INFO] ------------------------------------------------------------------------
[INFO] Reactor Summary for μStories 25/26 Team A 0.1.0-SNAPSHOT:
[INFO] 
[INFO] μStories 25/26 Team A .............................. SUCCESS [ 17.920 s]
[INFO] Domain ............................................. SUCCESS [ 19.093 s]
[INFO] Tests .............................................. SUCCESS [  5.320 s]
[INFO] Service ............................................ SUCCESS [01:25 min]
[INFO] REST ............................................... SUCCESS [ 50.761 s]
[INFO] JSF ................................................ SUCCESS [ 20.589 s]
[INFO] EAR ................................................ SUCCESS [  4.685 s]
[INFO] ------------------------------------------------------------------------
[INFO] BUILD SUCCESS
[INFO] ------------------------------------------------------------------------
[INFO] Total time:  03:31 min
[INFO] Finished at: 2026-06-28T12:01:51+02:00
[INFO] ------------------------------------------------------------------------
Waiting for Jenkins to finish collecting data
[JENKINS] Archiving /var/lib/jenkins/workspace/microstories-2526-teamA/domain/pom.xml to es.uvigo.esei.dgss.teamA.microstories/dgss2526-teamA-microstories-domain/0.1.0-SNAPSHOT/dgss2526-teamA-microstories-domain-0.1.0-SNAPSHOT.pom
[JENKINS] Archiving /var/lib/jenkins/workspace/microstories-2526-teamA/domain/target/dgss2526-teamA-microstories-domain-0.1.0-SNAPSHOT.jar to es.uvigo.esei.dgss.teamA.microstories/dgss2526-teamA-microstories-domain/0.1.0-SNAPSHOT/dgss2526-teamA-microstories-domain-0.1.0-SNAPSHOT.jar
[JENKINS] Archiving /var/lib/jenkins/workspace/microstories-2526-teamA/domain/target/dgss2526-teamA-microstories-domain-0.1.0-SNAPSHOT-sources.jar to es.uvigo.esei.dgss.teamA.microstories/dgss2526-teamA-microstories-domain/0.1.0-SNAPSHOT/dgss2526-teamA-microstories-domain-0.1.0-SNAPSHOT-sources.jar
[JENKINS] Archiving /var/lib/jenkins/workspace/microstories-2526-teamA/domain/target/dgss2526-teamA-microstories-domain-0.1.0-SNAPSHOT-javadoc.jar to es.uvigo.esei.dgss.teamA.microstories/dgss2526-teamA-microstories-domain/0.1.0-SNAPSHOT/dgss2526-teamA-microstories-domain-0.1.0-SNAPSHOT-javadoc.jar
[JENKINS] Archiving /var/lib/jenkins/workspace/microstories-2526-teamA/ear/pom.xml to es.uvigo.esei.dgss.teamA.microstories/dgss2526-teamA-microstories-ear/0.1.0-SNAPSHOT/dgss2526-teamA-microstories-ear-0.1.0-SNAPSHOT.pom
[JENKINS] Archiving /var/lib/jenkins/workspace/microstories-2526-teamA/ear/target/dgss2526-teamA-microstories-pom-0.1.0-SNAPSHOT.ear to es.uvigo.esei.dgss.teamA.microstories/dgss2526-teamA-microstories-ear/0.1.0-SNAPSHOT/dgss2526-teamA-microstories-ear-0.1.0-SNAPSHOT.ear
[JENKINS] Archiving /var/lib/jenkins/workspace/microstories-2526-teamA/service/pom.xml to es.uvigo.esei.dgss.teamA.microstories/dgss2526-teamA-microstories-service/0.1.0-SNAPSHOT/dgss2526-teamA-microstories-service-0.1.0-SNAPSHOT.pom
[JENKINS] Archiving /var/lib/jenkins/workspace/microstories-2526-teamA/service/target/dgss2526-teamA-microstories-service-0.1.0-SNAPSHOT.jar to es.uvigo.esei.dgss.teamA.microstories/dgss2526-teamA-microstories-service/0.1.0-SNAPSHOT/dgss2526-teamA-microstories-service-0.1.0-SNAPSHOT.jar
[JENKINS] Archiving /var/lib/jenkins/workspace/microstories-2526-teamA/service/target/dgss2526-teamA-microstories-service-0.1.0-SNAPSHOT-sources.jar to es.uvigo.esei.dgss.teamA.microstories/dgss2526-teamA-microstories-service/0.1.0-SNAPSHOT/dgss2526-teamA-microstories-service-0.1.0-SNAPSHOT-sources.jar
[JENKINS] Archiving /var/lib/jenkins/workspace/microstories-2526-teamA/service/target/dgss2526-teamA-microstories-service-0.1.0-SNAPSHOT-javadoc.jar to es.uvigo.esei.dgss.teamA.microstories/dgss2526-teamA-microstories-service/0.1.0-SNAPSHOT/dgss2526-teamA-microstories-service-0.1.0-SNAPSHOT-javadoc.jar
[JENKINS] Archiving /var/lib/jenkins/workspace/microstories-2526-teamA/service/target/dgss2526-teamA-microstories-service-0.1.0-SNAPSHOT-tests.jar to es.uvigo.esei.dgss.teamA.microstories/dgss2526-teamA-microstories-service/0.1.0-SNAPSHOT/dgss2526-teamA-microstories-service-0.1.0-SNAPSHOT-tests.jar
[JENKINS] Archiving /var/lib/jenkins/workspace/microstories-2526-teamA/tests/pom.xml to es.uvigo.esei.dgss.teamA.microstories/dgss2526-teamA-microstories-tests/0.1.0-SNAPSHOT/dgss2526-teamA-microstories-tests-0.1.0-SNAPSHOT.pom
[JENKINS] Archiving /var/lib/jenkins/workspace/microstories-2526-teamA/tests/target/dgss2526-teamA-microstories-tests-0.1.0-SNAPSHOT.jar to es.uvigo.esei.dgss.teamA.microstories/dgss2526-teamA-microstories-tests/0.1.0-SNAPSHOT/dgss2526-teamA-microstories-tests-0.1.0-SNAPSHOT.jar
[JENKINS] Archiving /var/lib/jenkins/workspace/microstories-2526-teamA/tests/target/dgss2526-teamA-microstories-tests-0.1.0-SNAPSHOT-sources.jar to es.uvigo.esei.dgss.teamA.microstories/dgss2526-teamA-microstories-tests/0.1.0-SNAPSHOT/dgss2526-teamA-microstories-tests-0.1.0-SNAPSHOT-sources.jar
[JENKINS] Archiving /var/lib/jenkins/workspace/microstories-2526-teamA/tests/target/dgss2526-teamA-microstories-tests-0.1.0-SNAPSHOT-javadoc.jar to es.uvigo.esei.dgss.teamA.microstories/dgss2526-teamA-microstories-tests/0.1.0-SNAPSHOT/dgss2526-teamA-microstories-tests-0.1.0-SNAPSHOT-javadoc.jar
[JENKINS] Archiving /var/lib/jenkins/workspace/microstories-2526-teamA/rest/pom.xml to es.uvigo.esei.dgss.teamA.microstories/dgss2526-teamA-microstories-rest/0.1.0-SNAPSHOT/dgss2526-teamA-microstories-rest-0.1.0-SNAPSHOT.pom
[JENKINS] Archiving /var/lib/jenkins/workspace/microstories-2526-teamA/rest/target/dgss2526-teamA-microstories-rest-0.1.0-SNAPSHOT.war to es.uvigo.esei.dgss.teamA.microstories/dgss2526-teamA-microstories-rest/0.1.0-SNAPSHOT/dgss2526-teamA-microstories-rest-0.1.0-SNAPSHOT.war
[JENKINS] Archiving /var/lib/jenkins/workspace/microstories-2526-teamA/rest/target/dgss2526-teamA-microstories-rest-0.1.0-SNAPSHOT-sources.jar to es.uvigo.esei.dgss.teamA.microstories/dgss2526-teamA-microstories-rest/0.1.0-SNAPSHOT/dgss2526-teamA-microstories-rest-0.1.0-SNAPSHOT-sources.jar
[JENKINS] Archiving /var/lib/jenkins/workspace/microstories-2526-teamA/rest/target/dgss2526-teamA-microstories-rest-0.1.0-SNAPSHOT-javadoc.jar to es.uvigo.esei.dgss.teamA.microstories/dgss2526-teamA-microstories-rest/0.1.0-SNAPSHOT/dgss2526-teamA-microstories-rest-0.1.0-SNAPSHOT-javadoc.jar
[JENKINS] Archiving /var/lib/jenkins/workspace/microstories-2526-teamA/jsf/pom.xml to es.uvigo.esei.dgss.teamA.microstories/dgss2526-teamA-microstories-jsf/0.1.0-SNAPSHOT/dgss2526-teamA-microstories-jsf-0.1.0-SNAPSHOT.pom
[JENKINS] Archiving /var/lib/jenkins/workspace/microstories-2526-teamA/jsf/target/dgss2526-teamA-microstories-jsf-0.1.0-SNAPSHOT.war to es.uvigo.esei.dgss.teamA.microstories/dgss2526-teamA-microstories-jsf/0.1.0-SNAPSHOT/dgss2526-teamA-microstories-jsf-0.1.0-SNAPSHOT.war
[JENKINS] Archiving /var/lib/jenkins/workspace/microstories-2526-teamA/jsf/target/dgss2526-teamA-microstories-jsf-0.1.0-SNAPSHOT-sources.jar to es.uvigo.esei.dgss.teamA.microstories/dgss2526-teamA-microstories-jsf/0.1.0-SNAPSHOT/dgss2526-teamA-microstories-jsf-0.1.0-SNAPSHOT-sources.jar
[JENKINS] Archiving /var/lib/jenkins/workspace/microstories-2526-teamA/jsf/target/dgss2526-teamA-microstories-jsf-0.1.0-SNAPSHOT-javadoc.jar to es.uvigo.esei.dgss.teamA.microstories/dgss2526-teamA-microstories-jsf/0.1.0-SNAPSHOT/dgss2526-teamA-microstories-jsf-0.1.0-SNAPSHOT-javadoc.jar
[JENKINS] Archiving /var/lib/jenkins/workspace/microstories-2526-teamA/pom.xml to es.uvigo.esei.dgss.teamA.microstories/dgss2526-teamA-microstories-pom/0.1.0-SNAPSHOT/dgss2526-teamA-microstories-pom-0.1.0-SNAPSHOT.pom
Xvfb stopping
channel stopped
[htmlpublisher] Archiving HTML reports...
[htmlpublisher] Archiving at PROJECT level /var/lib/jenkins/workspace/microstories-2526-teamA/domain/target/site/jacoco to /var/lib/jenkins/jobs/microstories-2526-teamA/htmlreports/Domain_JaCoCo_Report
[htmlpublisher] Archiving at PROJECT level /var/lib/jenkins/workspace/microstories-2526-teamA/rest/target/site/jacoco to /var/lib/jenkins/jobs/microstories-2526-teamA/htmlreports/REST_JaCoCo_Report
Sending e-mails to: mrjato@uvigo.gal pggonzalez20@esei.uvigo.es bspastoriza19@esei.uvigo.es sadielgodales@gmail.com jlcrivas@esei.uvigo.es isgarcia19@esei.uvigo.es arma_advent99@hotmail.com
Finished: UNSTABLE